program: Gaussian 16
title: Title Card Required
version: ES64L-G16RevA.03
frameworkgroup: C1[X(C7H5F17Sb2Te)]
method: RPBE1PBE
basis: def2TZVP
operation: Freq
keyword: #P
keyword: Geom=AllCheck
keyword: Guess=TCheck
keyword: SCRF=Check
keyword: GenChk
keyword: RPBE1PBE/def2TZVP
keyword: Freq
converged: YES YES NO NO
title: Mulliken charges:
elementType: C C C C C C H H H H H Te F F F Sb F F F F F F Sb F F F F F C F F F
charge: -0.080798 -0.256686 0.226027 -0.264412 -0.067491 -0.111020 0.166863 0.184797 0.182686 0.166441 0.163051 1.340028 -0.306486 -0.357800 -0.363021 1.868192 -0.414781 -0.449890 -0.415712 -0.407769 -0.428792 -0.419815 1.913279 -0.477527 -0.394532 -0.409753 -0.403339 -0.392788 0.430409 -0.073166 -0.072437 -0.073756
chargesum: -0.00000
title: Mulliken charges with hydrogens summed into heavy atoms:
elementType: C C C C C C Te F F F Sb F F F F F F Sb F F F F F C F F F
charge: 0.086065 -0.071889 0.226027 -0.081727 0.098951 0.052031 1.340028 -0.306486 -0.357800 -0.363021 1.868192 -0.414781 -0.449890 -0.415712 -0.407769 -0.428792 -0.419815 1.913279 -0.477527 -0.394532 -0.409753 -0.403339 -0.392788 0.430409 -0.073166 -0.072437 -0.073756
chargesum: 0.00000
polarizability: 2.34106556e+02 -4.85948099e+01 2.67105445e+02 -3.00936801e+01 2.55024085e+01 2.58876549e+02
1716.lowfreq: -8.8677 -6.2271 0.0004 0.0005 0.0006 6.3839 11.8449 22.0386 28.3108
frequency: 11.4535 21.7908 27.9474 30.9556 38.1876 40.7694 43.7247 48.2968 56.7165 61.6464 68.9834 76.5898 100.1405 111.8661 115.9844 120.8708 138.1432 140.9238 163.7741 178.6376 179.6056 191.2168 193.9223 203.0794 209.9155 212.1227 217.2858 219.0923 242.9469 250.1116 253.2178 254.8593 255.4183 257.0494 264.4429 266.6829 271.3148 275.1731 281.1758 284.5005 290.4609 305.3528 311.8404 403.6170 444.7473 459.3226 502.6970 548.0875 549.1261 576.8615 598.3829 607.3077 615.4457 641.3140 650.8839 666.4651 671.0097 671.4743 678.7500 680.2525 683.0793 688.4585 693.1481 708.1282 749.3254 752.4967 834.1048 954.5687 976.8127 997.3740 1025.2459 1030.4004 1045.5089 1067.0975 1121.6801 1186.7292 1208.4176 1289.2812 1309.5315 1346.9789 1367.7095 1486.2685 1500.2451 1614.8317 1643.7972 3212.2713 3223.7122 3230.7307 3253.3117 3256.5618
redmass: 13.2344 17.1851 19.9459 18.4223 14.5294 13.9117 14.0397 9.3590 5.1091 10.2462 15.2120 18.6513 13.1683 21.4671 20.2209 24.4004 17.5122 11.9739 18.8903 15.6671 17.8222 18.2634 12.2868 12.7364 14.5869 12.7307 19.5689 14.5317 15.7805 13.5785 18.8236 21.7935 21.5590 13.4146 18.7952 11.3646 19.6824 22.6064 21.7930 18.9647 9.9958 20.6620 22.8901 2.8869 4.6611 10.2390 19.2282 18.0171 18.0233 18.0973 19.0060 6.5441 21.6775 19.6584 19.7918 12.4736 6.6285 15.5710 15.9653 3.4895 17.7661 21.4301 23.1496 23.2083 1.6751 4.3451 1.2514 1.2932 7.9037 1.3697 8.8319 1.3917 5.9116 1.8645 1.5270 1.0736 1.1306 13.3341 13.2992 1.3505 6.2749 2.2963 1.9733 5.5598 6.2807 1.0877 1.0909 1.0963 1.0945 1.0941
irintensity: 0.2689 1.6948 0.2088 0.4929 1.7812 1.4238 0.4616 1.1464 0.7196 7.4268 9.7132 3.3525 1.1012 1.0348 2.1881 2.9716 2.0390 7.3471 4.5392 18.2807 21.1467 42.3001 9.6794 15.6363 104.0581 142.6356 35.0627 46.0698 140.6429 13.0060 94.2360 16.7458 85.8452 17.4236 11.7937 1.7676 19.8140 9.5634 42.8852 0.1607 10.5307 56.0494 135.8845 0.1356 116.0098 97.6891 208.7841 3.1217 2.4800 25.3658 5.1434 3.5843 262.2149 48.3069 98.4780 112.6892 39.2551 164.9879 145.3944 78.9731 18.4505 194.7209 153.3528 207.7771 130.5496 287.6320 0.3671 2.0617 425.8933 4.8770 727.4735 23.1980 32.0840 38.3174 4.9277 0.3509 8.6538 375.5111 361.0681 0.9184 28.1808 37.0557 21.3008 0.0935 0.0289 2.0479 2.9816 0.1934 15.7344 17.1382
temp: 298.150 k
press: 1.00000 atm
elementType: 6 6 6 6 6 6 1 1 1 1 1 52 9 9 9 51 9 9 9 9 9 9 51 9 9 9 9 9 6 9 9 9
symmnumber: 1
zpe: 363136.9 jmol-1
zpe.correction: 0.138312 hartree
zpe.thermalcorrener: 0.172075 hartree
zpe.thermalcorrenthalpy: 0.173019 hartree
zpe.thermalcorrgfe: 0.067527 hartree
zpe.sumelectzpe: -2714.705434 hartree
zpe.sumelectthermal: -2714.671671 hartree
zpe.sumelectthermalent: -2714.670727 hartree
zpe.sumelectthermalfe: -2714.776219 hartree
dipole: 9.2558 6.8416 2.9751
dipole: 11.8882
quadrupole: -222.4763 -194.3995 -199.9935
quadrupole: -5.1137 -10.0511 16.9596
quadrupole: -16.8532 11.2236 5.6296 -5.1137 -10.0511 16.9596
hfenergy: -2714.8437459 hartree
pointgroup: C01 [X(C7H5F17Sb2Te1)]
dipole: -3.349629 -3.0338645 1.2048215 debye
polarizability: 245.014723|-52.2190315|259.2878432|31.4227427|-21.0461421|255.7859839 unknown
InChI: InChI=1S/C7H5F6Te.10FH.F.2Sb/c8-7(9,10)14(11,12,13)6-4-2-1-3-5-6;;;;;;;;;;;;;/h1-5H;10*1H;;;/q;;;;;;;;;;;;2*+5/p-10
charge 0 multiplicity 1
32 atoms
C  0.08214123 -2.72362197 2.9189844
C  -0.80002649 -1.90895881 2.22797128
C  -0.94206774 -2.15609085 0.87225762
C  -0.25884911 -3.13347993 0.16704331
C  0.60835688 -3.93212733 0.8947454
C  0.77657909 -3.72630198 2.25672694
H  0.22310864 -2.56489567 3.98051128
H  -1.34553671 -1.12502879 2.73287609
H  -0.38727837 -3.27448002 -0.89602549
H  1.15757164 -4.71271195 0.38386594
H  1.46484099 -4.35332147 2.8101097
Te -2.32711734 -1.02317648 -0.16851278
F  -3.77924119 -2.15856489 -0.29481983
F  -3.08909182 -0.29019306 1.40280479
F  -1.74640162 -1.65181927 -1.86155499
Sb 2.88329851 -0.37784755 -0.85548847
F  3.16820261 0.66759463 -2.37719904
F  1.84860407 1.30764166 -0.15146329
F  4.36506827 0.42534949 -0.0491465
F  2.42293916 -1.14186876 0.78448638
F  3.80612569 -1.86859297 -1.48687645
F  1.22671656 -0.89859187 -1.55266477
Sb 0.28954969 2.17165663 0.76435475
F  -0.75302732 0.7012122 -0.00704576
F  0.02159184 3.05100759 -0.85139886
F  -1.24761748 2.87268256 1.54259831
F  1.46037439 3.47354898 1.38901769
F  0.64202143 1.0377139 2.1945789
C  -3.24790526 0.69448681 -1.31377651
F  -3.43988494 1.67808592 -0.4860723
F  -2.43401771 1.01953109 -2.27401123
F  -4.37587858 0.22837514 -1.77685349
