program: Gaussian 16
title: Title Card Required
version: ES64L-G16RevA.03
frameworkgroup: C1[X(C7H5F12SbTe)]
method: RPBE1PBE
basis: def2TZVP
operation: Freq
keyword: #P
keyword: Geom=AllCheck
keyword: Guess=TCheck
keyword: SCRF=Check
keyword: GenChk
keyword: RPBE1PBE/def2TZVP
keyword: Freq
converged: YES YES YES YES
title: Mulliken charges:
elementType: C C C C C C H H H H H Te F F F Sb F F F F F F C F F F
charge: 0.041222 -0.232453 0.354124 -0.215244 0.045378 -0.219982 0.194149 0.223566 0.218774 0.193956 0.176732 1.226476 -0.341794 -0.437386 -0.422154 1.852027 -0.472558 -0.435011 -0.439142 -0.440020 -0.438962 -0.457492 0.378953 -0.116061 -0.118111 -0.118988
chargesum: -0.00000
title: Mulliken charges with hydrogens summed into heavy atoms:
elementType: C C C C C C Te F F F Sb F F F F F F C F F F
charge: 0.235371 -0.008886 0.354124 0.003531 0.239334 -0.043250 1.226476 -0.341794 -0.437386 -0.422154 1.852027 -0.472558 -0.435011 -0.439142 -0.440020 -0.438962 -0.457492 0.378953 -0.116061 -0.118111 -0.118988
polarizability: 1.76342842e+02 -5.54195996e+00 3.01273412e+02 1.53476506e+01 -1.11222329e+00 1.95500668e+02
1716.lowfreq: -163.3881 -5.7828 -0.0007 -0.0005 0.0006 8.4162 12.0413 20.8194 25.3287
frequency: -163.3770 20.2984 24.4889 39.3250 41.4519 47.9007 51.8673 64.2602 69.5724 72.9062 76.6216 89.0220 126.8102 136.1917 163.4196 164.6852 175.1540 177.4168 193.7602 197.5779 256.5070 260.0894 263.9418 264.7141 266.9859 270.4651 275.1751 279.0916 292.8475 295.4695 408.1684 425.2988 473.2889 508.9319 529.3745 538.7725 542.4863 547.4959 551.4433 587.8134 599.5074 606.8215 621.3674 649.0680 654.1583 664.7645 670.6672 715.5444 753.2320 872.6017 882.0975 961.0037 998.9290 1011.6202 1048.0311 1081.8751 1089.4472 1147.6675 1151.5362 1205.2235 1227.0878 1229.2269 1309.2479 1397.8649 1502.8105 1514.7760 1766.0957 3209.6146 3213.5067 3237.9747 3254.3508 3259.8515
redmass: 6.6323 15.7467 12.1966 15.0520 11.9657 8.5791 18.5721 13.1102 6.7217 8.3637 16.7833 9.0344 18.6074 4.9957 18.2364 18.7054 18.6430 17.8653 20.6261 19.5776 20.4863 22.5260 21.4241 19.3097 23.8167 18.9867 20.0352 22.7932 22.4045 23.1662 3.7959 2.9505 5.4681 17.8302 18.5276 18.0126 17.5630 16.0003 19.3661 3.1165 1.4191 5.9036 17.7172 18.3471 20.7398 19.6978 21.3679 1.2139 15.1976 4.8075 1.3368 1.3135 1.3968 2.0048 1.4612 3.3065 10.1494 1.2031 1.1498 13.3305 2.6399 12.1846 1.4300 3.2173 3.0713 3.4163 8.7325 1.0891 1.0892 1.0955 1.0967 1.0978
irintensity: 118.5933 1.6536 2.2054 3.3943 2.7946 1.6310 2.3239 18.6580 4.6082 15.0341 8.0924 38.6239 1.4040 3.4168 1.2662 0.3471 2.1428 6.4830 27.7184 42.8299 15.1627 51.4884 49.8378 6.6210 123.0154 7.6820 46.2079 60.3820 54.2767 76.3344 19.1327 1.0786 14.1207 61.7784 140.0308 12.2064 16.6138 146.9019 230.6275 1.9961 11.9190 197.9734 191.6384 152.5093 161.7067 87.1467 204.8312 266.3662 77.4384 318.7857 7.5290 0.9301 9.5774 56.5555 11.3999 175.5352 913.8927 6.5652 18.6923 379.7834 95.8994 321.5306 19.3804 255.3378 14.8515 58.8356 41.4806 20.4774 4.5754 13.4352 141.2182 75.3877
temp: 298.150 k
press: 1.00000 atm
elementType: 6 6 6 6 6 6 1 1 1 1 1 52 9 9 9 51 9 9 9 9 9 9 6 9 9 9
symmnumber: 1
zpe: 318677.2 jmol-1
zpe.correction: 0.121378 hartree
zpe.thermalcorrener: 0.146593 hartree
zpe.thermalcorrenthalpy: 0.147538 hartree
zpe.thermalcorrgfe: 0.061970 hartree
zpe.sumelectzpe: -1975.326275 hartree
zpe.sumelectthermal: -1975.301059 hartree
zpe.sumelectthermalent: -1975.300115 hartree
zpe.sumelectthermalfe: -1975.385683 hartree
dipole: 7.5798 14.8795 -0.1745
dipole: 16.6998
quadrupole: -184.0932 -100.4544 -155.3664
quadrupole: 11.0925 6.0940 -0.6882
quadrupole: -37.4552 46.1836 -8.7284 11.0925 6.0940 -0.6882
hfenergy: -1975.4476524 hartree
pointgroup: C01 [X(C7H5F12Sb1Te1)]
dipole: 2.9453451 5.8710597 -0.1519635 debye
dipolederiv: -0.1338527 0.1425597 0.0685914 0.1203641 0.3665077 0.0749047 0.0371351 -0.6297106 -0.0489291 -0.0513195 -0.3610496 -0.1714708 -0.0771941 -1.1710407 -0.2861983 -0.1331853 0.2571928 -0.3313386 0.6534272 0.0268834 0.1355098 -0.2493261 2.7230977 -0.0059457 0.08868 -0.0740497 0.7789586 -0.0075711 -0.4180882 -0.048242 0.1375323 -1.142743 0.3183937 -0.1592392 0.0951988 -0.3777023 -0.1651241 0.5061645 -0.0289131 0.0396087 0.3538358 -0.135081 0.0453925 0.3551183 -0.0404819 -0.0821316 -0.0366883 -0.0452091 0.0459905 -0.0207606 -0.0160992 -0.0510768 0.0272302 -0.1964818 0.1594096 0.0496595 -0.0296854 -0.0162369 -0.0214101 -0.0318812 -0.0068573 0.0974454 0.1388876 0.2638176 -0.0736658 0.0141291 -0.0248378 0.2892864 0.0000208 0.0060717 0.0821329 0.3318204 0.3130833 -0.0814824 0.0294664 0.0233594 0.2774038 0.0119292 0.0371088 -0.0199313 0.307653 0.1668188 -0.0267027 0.0009704 0.0117947 -0.0183512 0.0440416 -0.0175442 -0.1024849 0.1339028 0.1879971 -0.0939368 -0.0137974 -0.0304042 0.081967 0.0104882 -0.0192137 0.0361437 0.1424984 3.1951976 0.0873175 -0.038691 0.4231548 1.2427492 0.1717868 0.0700861 0.1474547 3.6997867 -1.4449885 -0.043228 0.0151055 -0.0857582 -0.5061156 -0.0032022 -0.0222978 0.0017372 -0.4538316 -0.4970316 0.156963 -0.1913184 0.0780067 -0.6743681 0.0496688 -0.1813105 0.2175583 -1.5705216 -0.5575071 0.2465762 0.2762267 0.1226834 -0.7476762 -0.2069405 0.2487805 -0.39653 -1.5878139 4.4925514 0.3657191 -0.0091631 0.1431413 3.6967025 -0.0631961 0.0240489 -0.0472256 3.6100745 -1.7220839 -0.2288134 0.0130653 0.0591104 -0.8102471 -0.0733158 0.0403743 -0.1008223 -0.5803237 -0.6704773 -0.0359717 -0.0005422 -0.0846105 -0.7774887 0.24399 0.0884474 0.2841192 -0.9397421 -0.8451583 -0.2573123 -0.1443411 -0.2443376 -0.869419 -0.1696984 -0.1595243 -0.1799372 -0.7129431 -1.0395202 0.1731881 0.1454735 0.2317565 -0.7228015 -0.0801647 0.1444381 -0.0703147 -0.645453 -0.7031794 -0.0792224 0.0158739 -0.0243366 -0.7497982 0.2131631 -0.0470197 0.2051929 -0.9165861 -1.3954685 -0.2622744 0.006573 -0.5387333 -0.8840393 -0.0498505 -0.0438828 -0.1612746 -0.6499801 1.8519944 0.0295881 -0.0009382 -0.3706416 3.5539479 -0.0483106 0.0574561 -0.2382651 1.7822647 -0.307166 -0.1269139 -0.1253382 0.0196718 -1.3338794 -0.4178437 -0.0871507 -0.6421373 -0.8027068 -1.1272519 0.7236813 -0.2238305 0.4170093 -1.0788501 0.1186601 -0.2590353 0.2728995 -0.3475036 -0.5344652 -0.3829506 0.3504955 -0.1267669 -1.056509 0.3306809 0.299318 0.5832597 -0.7235077 unknown
polarizability: 175.8303415|-5.9610019|301.082815|15.1195585|-3.6484331|196.2037656 unknown
InChI: InChI=1S/C6H5.CF6Te.6FH.Sb/c1-2-4-6-5-3-1;2-1(3,4)8(5,6)7;;;;;;;/h1-5H;;6*1H;/q;;;;;;;;+6/p-6
charge 0 multiplicity 1
26 atoms
C  1.38105687 4.17412902 1.03026377
C  1.08710702 2.80262282 1.20181401
C  0.5859169 2.36793337 0.04835511
C  0.20669297 2.78812311 -1.15511971
C  0.53351527 4.16063461 -1.23099716
C  1.10357827 4.82805227 -0.15892787
H  1.82635806 4.68254263 1.8778411
H  1.27337709 2.24869492 2.11062792
H  -0.26336395 2.22857338 -1.95064971
H  0.30637007 4.66009988 -2.16596191
H  1.3281935 5.88265128 -0.24938069
Te 1.66325513 -0.34463207 -0.11420338
F  3.49757259 0.00404972 -0.07455399
F  1.81085354 -0.34507434 1.83009881
F  1.94717775 -0.6687055 -1.99837014
Sb -2.28355431 -0.41630078 -0.02524739
F  -0.66061906 -1.31468777 -0.58484524
F  -2.25988706 -1.44452492 1.54380369
F  -3.3086302 -1.71036161 -0.91141055
F  -3.77792689 0.54879 0.56470823
F  -2.17790994 0.62087186 -1.59323841
F  -1.0874233 0.82959415 0.80954664
C  1.86842456 -2.53807867 0.14906442
F  1.58553424 -3.1763117 -0.96675796
F  3.12163565 -2.78621983 0.49400379
F  1.06113324 -2.94590685 1.10938959
