program: Gaussian 16
title: Title Card Required
version: ES64L-G16RevA.03
frameworkgroup: C1[X(C7H5F12SbTe)]
method: RPBE1PBE
basis: def2SVP
operation: Freq
keyword: #P
keyword: Geom=AllCheck
keyword: Guess=TCheck
keyword: SCRF=Check
keyword: GenChk
keyword: RPBE1PBE/def2SVPFreq
converged: YES YES YES YES
title: Mulliken charges:
elementType: C C C C C C H H H H H Te F F F Sb F F F F F F C F F F
charge: -0.013945 0.044429 -0.334065 0.052732 -0.018314 0.025825 0.052180 0.070368 0.078225 0.054003 0.049355 1.638685 -0.352624 -0.379620 -0.375081 1.715790 -0.438130 -0.373950 -0.377131 -0.372904 -0.394488 -0.389896 0.358920 -0.099378 -0.116311 -0.104676
chargesum: -0.00000
title: Mulliken charges with hydrogens summed into heavy atoms:
elementType: C C C C C C Te F F F Sb F F F F F F C F F F
charge: 0.038235 0.114797 -0.334065 0.130958 0.035689 0.075181 1.638685 -0.352624 -0.379620 -0.375081 1.715790 -0.438130 -0.373950 -0.377131 -0.372904 -0.394488 -0.389896 0.358920 -0.099378 -0.116311 -0.104676
chargesum: 0.00000
polarizability: 1.25190564e+02 -3.08214180e+01 1.68635845e+02 6.00579781e+00 3.65572787e+00 1.24429550e+02
1716.lowfreq: -0.0009 -0.0001 0.0006 1.3666 2.8787 3.4875 19.8463 26.1906 36.4112
frequency: 19.8292 26.1706 36.4025 40.1655 52.7094 54.5374 70.8000 82.1918 109.6058 116.4824 135.7924 154.6994 181.5399 191.8266 200.2597 205.2669 216.6832 227.4177 238.0742 249.6718 256.2567 260.7205 263.9147 269.1871 276.1476 278.6262 283.9219 295.2789 317.3143 346.8715 408.2904 458.2710 470.4522 554.7977 557.4691 600.0802 610.6341 616.5783 644.7949 659.6404 666.6595 680.4438 688.7852 697.6742 710.7295 711.2492 753.5477 777.4782 841.7739 950.7093 988.3361 1004.9888 1035.4121 1054.5332 1077.1208 1103.9636 1114.2087 1178.1695 1197.5663 1326.5254 1338.3872 1356.9780 1404.0829 1486.9724 1502.7619 1650.1122 1671.3101 3220.5414 3231.9818 3239.5622 3259.8890 3268.6657
redmass: 18.7067 11.5866 15.2095 5.9700 7.0513 16.6215 8.5825 14.7645 17.6800 19.3823 18.2588 10.8612 16.9398 15.2526 12.8024 13.6761 12.1108 9.6035 14.4327 16.4558 17.7768 14.4061 19.9563 10.4641 18.9606 20.9061 14.8788 9.7953 20.1607 25.5899 2.8624 17.9605 3.8587 18.0511 18.0200 18.0625 6.4841 18.6191 19.0796 22.7139 14.0400 7.4069 2.6985 19.8206 22.9697 22.8434 1.3543 16.3723 1.2518 1.3162 6.7259 1.3783 1.3467 3.5054 2.1495 12.3569 1.4372 1.0690 1.1177 1.2811 13.3138 13.3073 8.3171 2.4910 2.1776 6.0563 6.7853 1.0879 1.0925 1.0984 1.0962 1.0959
irintensity: 0.0897 0.1710 0.2681 0.8914 0.4908 0.4189 0.3088 0.3097 0.1721 0.9364 0.0568 2.7015 1.2546 3.0155 0.2462 2.3608 5.6474 38.9242 6.4857 59.4752 17.9928 55.2974 35.6883 1.4431 18.2126 18.6903 22.8910 5.2501 11.0007 123.0583 0.0808 173.2362 6.9312 0.5559 3.8838 4.0325 0.4917 0.3485 7.6613 95.6472 70.9720 16.5594 65.9864 61.2751 88.7404 83.6099 43.7537 102.0156 0.1167 0.9920 45.2217 0.1261 0.0124 5.5039 0.6916 725.0187 3.7051 0.1124 3.1870 3.0826 248.9129 225.8407 11.1985 24.1429 17.0355 1.2874 0.0242 1.0066 1.5670 0.0545 12.2626 16.1012
temp: 298.150 k
press: 1.00000 atm
elementType: 6 6 6 6 6 6 1 1 1 1 1 52 9 9 9 51 9 9 9 9 9 9 6 9 9 9
symmnumber: 1
zpe: 336333.0 jmol-1
zpe.correction: 0.128102 hartree
zpe.thermalcorrener: 0.152298 hartree
zpe.thermalcorrenthalpy: 0.153242 hartree
zpe.thermalcorrgfe: 0.071035 hartree
zpe.sumelectzpe: -1973.495663 hartree
zpe.sumelectthermal: -1973.471468 hartree
zpe.sumelectthermalent: -1973.470524 hartree
zpe.sumelectthermalfe: -1973.552730 hartree
dipole: 3.8681 4.6805 0.1476
dipole: 6.0738
quadrupole: -167.1653 -133.2818 -154.7313
quadrupole: -13.5060 2.2416 0.5847
quadrupole: -15.4392 18.4443 -3.0052 -13.5060 2.2416 0.5847
hfenergy: -1973.6237656 hartree
pointgroup: C01 [X(C7H5F12Sb1Te1)]
dipole: 1.9585468 1.3657888 0.095125 debye
dipolederiv: -0.0835985 0.0110922 -0.0478299 0.0492575 -0.0758667 0.1975864 0.0132128 -0.0015915 0.016397 -0.0274422 0.0763729 0.0298325 -0.0118851 -0.2477504 -0.196943 -0.0597692 0.2828479 -0.0849402 -0.2471497 -0.0889015 0.0150134 -0.1019693 0.3490688 0.0065143 0.0268372 -0.0146293 -0.1260916 -0.0091518 -0.0104003 -0.0391914 0.1013831 -0.2406478 0.2002895 0.0417854 -0.2573629 -0.1034547 -0.05697 0.0121485 0.0884008 -0.0367268 -0.0775455 -0.1969191 0.0079379 0.0023644 -0.0026563 -0.0293724 -0.0696242 0.0170811 -0.0497192 0.1288201 0.0085748 0.0217386 0.0057716 0.0432745 0.1210395 0.0357495 -0.0089421 0.0153544 0.0227993 -0.0419871 -0.0158651 -0.0266229 0.0199177 0.1169107 -0.0051224 -0.0027361 0.0048672 0.1444833 0.0269242 0.0005257 0.0213837 0.1161947 0.1375461 -0.0041102 -0.0060604 0.0070442 0.1473018 -0.0213864 -0.0016104 -0.0151495 0.1342072 0.1129417 0.0417679 -0.0331645 0.0303493 0.0276671 0.0286972 -0.0253684 0.0080756 0.0270908 0.1058733 0.0304748 -0.0040044 0.0325854 -0.0121541 -0.0033319 -0.004529 -0.0035063 0.0932563 3.2119247 -0.0299053 -0.0311308 0.116144 2.1522855 0.0123306 -0.1224599 0.0077214 2.3802183 -0.9446613 0.0725932 0.1008347 -0.0023155 -0.6155721 0.0066009 0.1128015 -0.0041731 -0.3518386 -0.4166449 0.0575037 -0.1313086 0.06778 -0.6834797 0.025656 -0.1441224 -0.02062 -0.8109727 -0.3943134 0.0606747 -0.0357337 0.0557311 -0.6764113 -0.0663526 -0.0557267 -0.0179993 -0.8095369 3.6559123 0.3609171 -0.0240719 -0.0587895 2.4834371 0.0270414 0.0910789 -0.0316118 2.3805203 -1.9395464 -0.1672796 0.0880328 0.071207 -0.6547203 0.0252572 0.0515623 0.0547283 -0.3591074 -0.5816468 -0.063884 0.0630242 -0.0364817 -0.4857035 0.0706543 0.0864591 0.0824415 -0.630887 -0.5728134 -0.0759458 -0.0079222 -0.061954 -0.6436333 -0.0808081 -0.0304068 -0.076588 -0.4776085 -0.7846908 0.0257493 -0.0576232 0.0730059 -0.4726881 0.0154311 -0.062908 0.015575 -0.4646812 -0.6831681 -0.138357 0.0117566 -0.0801086 -0.4975729 0.0092709 0.0588323 0.0568609 -0.549825 -0.6598203 -0.1380262 0.0157492 -0.0945901 -0.574706 -0.0538979 0.0008781 -0.0566639 -0.4426545 1.4984492 -0.1057455 -0.0170607 -0.3983925 2.9525517 -0.0002226 0.004228 -0.0351718 1.4265836 -0.4482651 -0.3325672 -0.2443098 -0.1239883 -0.8314217 -0.2088698 -0.2262061 -0.3528846 -0.4504843 -0.8486519 0.5293879 0.1534433 0.3973005 -0.8032611 -0.0758257 0.1752828 -0.1384721 -0.2586431 -0.2326906 -0.0845624 0.1079212 0.0349108 -0.8152801 0.2857152 0.0558112 0.5152766 -0.7142784 unknown
polarizability: 112.3285462|-15.345171|181.3293046|6.4107266|2.8613873|124.5981083 unknown
InChI: InChI=1S/C7H5F7Te.5FH.Sb/c8-7(9,10)15(11,12,13,14)6-4-2-1-3-5-6;;;;;;/h1-5H;5*1H;/q;;;;;;+5/p-5
charge 0 multiplicity 1
26 atoms
C  0.87066064 3.8326131 1.2211789
C  1.25031961 2.49356521 1.20456162
C  1.19011896 1.83465438 -0.01889919
C  0.75549517 2.41467859 -1.20504892
C  0.38281268 3.7555047 -1.15132515
C  0.43922734 4.45680004 0.05156542
H  0.90241968 4.38390414 2.16306061
H  1.57093575 1.98235275 2.11199782
H  0.68228359 1.84049784 -2.12761822
H  0.03061778 4.24536491 -2.06127252
H  0.13165106 5.50435294 0.08068023
Te 1.67992466 -0.19432582 -0.05100956
F  3.54363509 -0.02967785 -0.41461656
F  2.06491259 -0.22313389 1.84051414
F  1.32965595 -0.35225304 -1.93977496
Sb -2.30566725 -0.03456439 -0.00841531
F  -0.31121814 -0.65292867 0.43083804
F  -2.69192751 -0.70935337 1.72029655
F  -2.46312055 -1.78048918 -0.73263171
F  -4.05299679 0.54273417 -0.43693973
F  -1.49515581 0.53941491 -1.63919058
F  -1.7458872 1.60967574 0.77648284
C  1.75895007 -2.42275152 -0.01930506
F  0.88256084 -2.8653257 -0.87387216
F  2.97246483 -2.76593638 -0.36731224
F  1.48831696 -2.8237176 1.19049971
