program: Gaussian 09
title: 000034059
version: EM64L-G09RevD.01
frameworkgroup: C1[X(C24H22O8)]
method: RPBEPBE
basis: SDD
operation: Freq
keyword: #pfreq=noraman
keyword: PBEPBE/SDD
title: #p freq=noraman PBEPBE/SDD
converged: YES YES NO NO
title: Mulliken charges:
elementType: O O O O O O O O C C C C C C C C C C C C C C C C C C C C C C C C H H H H H H H H H H H H H H H H H H H H H H
charge: -0.255404 -0.255399 -0.250011 -0.250018 -0.272902 -0.272919 -0.225165 -0.225159 0.093021 0.093017 0.085525 0.085513 0.117138 0.117113 0.242849 0.242877 0.461035 0.461023 -0.655771 -0.655766 0.298796 0.298801 -0.811827 -0.811817 -0.490661 -0.490659 0.113621 0.113624 -0.536035 -0.536030 -0.537060 -0.537049 0.243415 0.243419 0.240011 0.222888 0.243158 0.222884 0.243160 0.240008 0.252451 0.252451 0.216341 0.238760 0.245759 0.245756 0.216342 0.238761 0.234422 0.237450 0.248197 0.248195 0.234424 0.237448
chargesum: 0.00000
title: Mulliken charges with hydrogens summed into heavy atoms:
elementType: O O O O O O O O C C C C C C C C C C C C C C C C C C C C C C C C
charge: -0.255404 -0.255399 -0.250011 -0.250018 -0.272902 -0.272919 -0.225165 -0.225159 0.093021 0.093017 0.085525 0.085513 0.117138 0.117113 0.242849 0.242877 0.461035 0.461023 -0.412357 -0.412347 0.298796 0.298801 -0.105770 -0.105765 -0.238210 -0.238208 0.113621 0.113624 0.164826 0.164829 0.183010 0.183018
polarizability: 4.05263474e+02 1.47892930e+00 3.43169355e+02 1.10224158e-02 -8.23707449e-03 2.21617956e+02
1716.lowfreq: -0.0006 0.0005 0.0006 3.0546 3.1769 7.8578 22.2601 28.9024 33.0401
frequency: 22.2096 28.9018 32.9985 47.9876 52.0076 52.5900 58.8901 110.7782 113.6409 120.7918 124.1488 127.0675 150.5460 162.7844 163.1607 171.5119 172.0804 185.8247 190.3626 196.1096 211.2514 211.6148 222.7655 243.8640 248.7558 250.4855 265.1924 265.6445 271.7244 276.0828 314.6329 317.0995 317.1803 318.9998 337.7252 345.9943 367.1924 406.5294 426.6856 436.1578 447.3095 450.1508 518.0052 519.9157 535.7711 552.1901 557.2771 575.1317 584.2076 596.3254 600.8369 631.6980 647.6029 661.4379 662.5935 665.3939 689.0324 691.9056 712.3012 720.1028 720.3201 760.4732 787.7463 789.8428 819.0636 825.0719 825.3398 841.9855 847.9013 849.3025 917.1781 921.3518 935.7204 985.0387 997.8900 1010.4072 1030.3379 1045.0702 1045.2043 1049.4090 1062.6914 1092.4792 1104.4408 1112.7839 1112.7919 1112.9177 1113.1016 1140.7973 1141.0077 1161.0094 1161.4527 1180.9385 1182.8121 1193.3049 1208.0728 1223.3110 1226.3225 1260.1636 1297.0727 1308.8927 1346.4670 1351.8549 1376.2563 1378.9999 1401.6148 1403.9521 1407.4543 1423.6051 1435.9481 1439.9223 1440.1254 1449.1333 1459.4980 1459.5549 1467.2129 1468.7442 1469.2784 1469.6512 1470.1970 1470.9131 1471.0323 1472.2906 1475.4734 1475.8002 1484.3811 1499.1501 1540.9811 1564.6606 1586.8901 1592.1661 1598.8545 1606.8341 1683.1933 1683.3069 2968.2137 2968.5149 2976.5815 2976.6569 2993.3076 2993.3910 3063.5410 3063.6557 3072.7372 3072.7495 3082.7531 3082.7727 3089.5185 3089.5319 3129.8927 3129.9243 3134.8662 3134.8781 3163.9538 3164.0384 3202.1026 3202.1096
redmass: 5.0945 6.3366 5.9839 4.5420 3.3547 3.5103 4.5225 4.8432 4.4977 5.2759 4.0301 4.0988 4.6500 6.3279 3.6009 2.9947 2.9993 1.7545 4.6099 1.7997 1.1034 1.0786 3.2530 1.6542 1.8569 4.7098 1.2873 1.3252 4.3456 3.8151 4.6027 5.1808 4.6587 5.3245 4.0621 4.0158 6.5424 6.7748 7.9557 7.3504 5.2024 5.0042 8.0924 8.1854 5.7815 5.7255 5.3659 4.1454 4.4844 6.1824 5.6998 5.0284 4.9241 6.2241 5.2143 5.2535 5.4225 8.2871 6.1506 4.5115 4.3337 6.1010 5.2744 5.2237 6.3021 1.5732 1.5735 5.2662 1.6132 1.7240 8.9675 8.9014 8.3355 6.7721 3.0991 2.7180 2.7388 1.5816 1.5553 2.3975 3.9887 6.1425 5.5688 1.2601 1.2601 1.2597 1.2661 1.8551 2.0919 1.4666 1.4799 2.1159 2.5399 4.1631 2.8626 1.8242 1.4979 2.3183 5.1504 5.1287 3.0822 2.9907 6.3451 6.0478 1.5283 1.2586 2.1442 1.5814 1.4392 1.2069 1.2182 2.3997 1.0473 1.0490 1.2144 1.0642 1.0718 1.0661 1.0671 1.0979 1.1150 1.1008 1.0846 1.1007 2.2888 3.5683 8.1777 8.1497 9.0821 9.1702 7.1490 8.0298 10.3975 10.3895 1.0328 1.0328 1.0317 1.0317 1.0362 1.0362 1.1036 1.1037 1.1047 1.1048 1.0968 1.0968 1.1008 1.1008 1.1004 1.1004 1.1013 1.1013 1.0900 1.0900 1.0904 1.0904
irintensity: 0.1199 8.2259 3.9420 0.7300 0.3035 1.9066 2.8522 0.6962 0.9666 4.8009 1.4782 0.0111 0.0843 3.6426 3.5315 7.8059 2.5815 0.0147 0.1533 0.3670 0.4743 1.2346 7.0173 0.4286 0.0417 0.0012 1.0075 0.3281 3.4376 0.9852 1.1228 6.8233 0.9206 0.3188 6.8790 5.6102 0.7194 1.6202 1.6153 2.9003 18.4700 0.1440 0.4200 0.7501 10.7453 2.0948 14.6653 9.0893 3.2830 0.5942 7.8758 8.4458 3.1494 1.1762 0.5201 0.2859 0.0000 32.1948 10.7843 1.3338 11.8671 3.8264 4.7440 20.2864 110.5074 23.1920 71.1999 0.8536 8.2597 31.8371 34.0395 9.7914 59.5759 13.9608 23.8286 46.7899 36.6507 20.1935 0.9606 23.5660 254.8242 82.6598 97.7390 0.0347 0.0357 0.9089 1.7307 1.3460 72.1588 25.0217 10.0686 40.3982 17.6249 47.9660 440.4749 0.2722 44.8206 7.9809 83.1731 38.2126 220.7255 93.2782 20.1622 0.4231 192.2333 2.0324 107.5586 3.8514 33.4512 9.6989 1.6774 40.2671 13.4353 17.3077 31.3019 1.8341 60.9325 17.0354 62.6267 23.7780 1.5471 51.6888 52.5563 22.0224 32.3846 0.0014 7.7163 0.0940 357.8295 133.5416 475.4620 144.1148 914.0574 128.3457 102.3691 48.2463 85.3820 14.6077 55.6909 2.2738 15.5789 44.3872 18.9797 38.1831 12.0698 12.5145 13.3374 36.6507 9.9199 28.8768 32.0425 0.2593 18.6064 5.5465 3.1253 0.6780
temp: 298.150 k
press: 1.00000 atm
elementType: 8 8 8 8 8 8 8 8 6 6 6 6 6 6 6 6 6 6 6 6 6 6 6 6 6 6 6 6 6 6 6 6 1 1 1 1 1 1 1 1 1 1 1 1 1 1 1 1 1 1 1 1 1 1
symmnumber: 1
zpe: 1075689.7 jmol-1
zpe.correction: 0.409709 hartree
zpe.thermalcorrener: 0.440317 hartree
zpe.thermalcorrenthalpy: 0.441261 hartree
zpe.thermalcorrgfe: 0.348524 hartree
zpe.sumelectzpe: -1527.207280 hartree
zpe.sumelectthermal: -1527.176672 hartree
zpe.sumelectthermalent: -1527.175728 hartree
zpe.sumelectthermalfe: -1527.268465 hartree
dipole: 0.0001 0.0006 3.6401
dipole: 3.6401
quadrupole: -113.9359 -187.8457 -181.8244
quadrupole: -9.6611 0.0046 -0.0039
quadrupole: 47.2661 -26.6437 -20.6224 -9.6611 0.0046 -0.0039
hfenergy: -1527.6169887 hartree
pointgroup: C01 [X(C24H22O8)]
dipole: 0.0000526 -0.000245 -1.4321423 debye
polarizability: 405.2780468|-1.1323173|343.154782|-0.0109763|-0.0082985|221.6179556 unknown
InChI: InChI=1S/C24H22O8/c1-11-7-13(27-3)21(23-19(11)15(29-5)9-17(25)31-23)22-14(28-4)8-12(2)20-16(30-6)10-18(26)32-24(20)22/h7-10H,1-6H3
charge 0 multiplicity 1
54 atoms
O  1.539801 -1.442665 0.719459
O  -1.539894 1.442899 0.719523
O  -0.274702 2.104334 -1.848548
O  0.274736 -2.104409 -1.847993
O  5.348815 0.323543 0.92681
O  -5.348732 -0.32364 0.927321
O  2.264323 -3.300282 1.871837
O  -2.264402 3.30047 1.87198
C  0.657904 0.347287 -0.550667
C  -0.657985 -0.347115 -0.550572
C  1.779394 -0.211129 0.102166
C  -1.779457 0.211327 0.102285
C  3.06101 0.433383 0.16052
C  -3.061039 -0.433239 0.160787
C  0.834998 1.608952 -1.170503
C  -0.835046 -1.608897 -1.170174
C  3.200715 1.719646 -0.462949
C  -3.200736 -1.719567 -0.462519
C  2.084013 2.279161 -1.112454
C  -2.084034 -2.27915 -1.111969
C  4.106608 -0.296839 0.872491
C  -4.10662 0.296928 0.872811
C  4.489445 2.525825 -0.469073
C  -4.489437 -2.525795 -0.468346
C  3.871165 -1.536983 1.452472
C  -3.871214 1.537123 1.452702
C  2.581833 -2.186593 1.401873
C  -2.581954 2.186854 1.401868
C  -0.22772 3.48458 -2.34292
C  0.227802 -3.48471 -2.34222
C  6.439637 -0.359228 1.638204
C  -6.439604 0.358982 1.638785
H  2.197661 3.258118 -1.585444
H  -2.197647 -3.258222 -1.584727
H  5.313932 1.974387 -0.952387
H  4.33799 3.47633 -1.008606
H  4.830749 2.75491 0.554836
H  -4.338025 -3.476393 -1.007724
H  -4.830606 -2.754707 0.55565
H  -5.314004 -1.974464 -0.951648
H  4.648231 -2.092687 1.978644
H  -4.648246 2.092771 1.978982
H  0.535426 3.602203 -3.136389
H  -0.031859 4.19293 -1.516849
H  -1.227617 3.668172 -2.761845
H  1.227719 -3.668328 -2.761084
H  -0.535312 -3.602426 -3.135704
H  0.031918 -4.192986 -1.516089
H  6.672349 -1.331128 1.164758
H  6.183175 -0.509816 2.70317
H  7.299809 0.319526 1.549168
H  -7.299654 -0.319947 1.549906
H  -6.672565 1.330796 1.165285
H  -6.183046 0.509708 2.703707
