program: Gaussian 09
title: 000033856
version: EM64L-G09RevD.01
frameworkgroup: C1[X(C10H17NO4)]
method: RPBEPBE
basis: SDD
operation: Freq
keyword: #p
keyword: freq=noraman
keyword: PBEPBE/SDD
title: #p freq=noraman PBEPBE/SDD
converged: YES YES NO NO
title: Mulliken charges:
elementType: O O O O N C C C C C C C C C C H H H H H H H H H H H H H H H H H
charge: -0.301235 -0.287365 -0.276735 -0.286834 -0.616158 0.369707 -0.464709 -0.464014 -0.378635 -0.387064 -0.390798 -0.029950 -0.340352 -0.356784 0.295811 0.213859 0.217547 0.209692 0.215674 0.215783 0.196072 0.196822 0.218723 0.189096 0.202767 0.254846 0.196901 0.231948 0.240664 0.232753 0.340553 0.341414
chargesum: 0.00000
title: Mulliken charges with hydrogens summed into heavy atoms:
elementType: O O O O N C C C C C C C C C C
charge: -0.301235 -0.287365 -0.276735 -0.286834 0.065809 0.369707 -0.033303 -0.038648 0.033220 0.028481 0.001066 0.224897 0.088496 0.116633 0.295811
polarizability: 1.38957657e+02 -3.90702524e-01 1.23631421e+02 -6.51371021e+00 1.24157028e+00 1.05299733e+02
1716.lowfreq: -33.0764 -0.0002 0.0005 0.0009 5.2996 7.5827 16.5527 45.7340 46.5343
frequency: -10.9313 45.4540 46.4551 58.2844 93.6343 108.8747 184.9691 190.2478 274.5399 276.8036 295.7976 314.0032 357.8616 390.2349 421.5471 441.8261 470.7449 485.3495 501.1283 512.8932 524.1421 601.9395 621.8680 641.5028 704.4446 725.1391 774.5470 787.4403 803.5633 835.4823 858.9589 877.3122 905.4559 923.3820 928.4105 947.6228 985.8050 1016.8004 1026.5535 1044.8373 1057.9686 1066.8095 1068.2342 1073.8007 1092.3716 1121.6785 1140.9572 1154.6778 1172.8974 1231.2578 1246.8866 1255.7847 1268.7190 1275.0654 1281.5856 1310.5855 1319.4711 1321.9142 1331.4259 1337.4778 1341.8091 1347.4004 1358.1530 1389.9897 1428.9450 1448.6536 1459.3668 1462.1206 1469.0138 1477.8731 1478.4548 1587.8121 1687.2293 2966.2733 2967.9498 2984.4884 2987.6845 2993.3324 2999.9020 3001.0727 3022.3763 3032.9040 3041.2703 3049.1440 3057.7115 3069.2682 3077.1167 3113.8331 3557.9182 3716.2059
redmass: 5.0178 4.7796 4.6522 4.0983 3.7787 3.3564 3.8102 2.8976 3.5318 2.6212 2.5775 4.0403 2.4760 2.6005 2.8012 2.4989 3.0331 2.9813 1.1838 2.0889 1.0804 3.3517 4.6013 3.8343 11.3528 6.0709 1.4621 3.5669 2.5175 2.6527 4.4988 1.7412 2.3438 2.0870 1.4120 2.5212 5.1471 6.7598 2.7508 1.8402 2.0363 2.3130 1.4704 2.3720 1.5299 2.4027 1.6850 2.2625 1.2720 1.6885 1.3349 1.1631 1.3265 1.3880 1.2890 2.6778 1.3771 1.4034 1.4844 1.4160 1.4497 1.3787 1.4995 1.5066 1.1136 1.0877 1.0958 1.0858 1.0841 1.0867 1.0923 1.2150 7.1345 1.0632 1.0672 1.0607 1.0605 1.0632 1.0780 1.0669 1.0609 1.0960 1.1010 1.1020 1.1027 1.1025 1.0993 1.1038 1.0446 1.1058
irintensity: 0.3532 1.6350 3.8976 7.5643 3.8913 6.6664 2.8434 1.9899 3.1846 1.0082 8.0541 6.7398 1.9624 10.4137 4.7919 3.5441 10.5735 5.2863 262.1373 1.6792 74.3668 4.3823 0.6741 8.1322 38.9745 5.0149 1.2683 19.0837 22.5089 13.2778 42.5749 24.4041 14.4219 7.6820 6.2419 3.1432 128.9143 135.0700 45.3678 5.5225 23.6431 40.8271 18.5990 37.6859 1.7421 1.6714 3.7252 26.7766 0.2307 11.8111 10.8873 2.7405 25.7346 32.4920 10.7752 343.3714 4.7284 15.6386 15.7672 1.1463 0.4596 14.3250 19.3330 7.8487 31.2871 10.8416 4.7950 11.4274 19.2749 1.9872 9.2659 94.8395 351.8772 46.3526 59.2117 26.5079 31.1401 18.8878 37.1958 14.2662 30.0689 60.5400 53.3440 20.6735 40.4661 59.1898 25.4302 8.8258 67.8388 53.0857
temp: 298.150 k
press: 1.00000 atm
elementType: 8 8 8 8 7 6 6 6 6 6 6 6 6 6 6 1 1 1 1 1 1 1 1 1 1 1 1 1 1 1 1 1
symmnumber: 1
zpe: 704066.3 jmol-1
zpe.correction: 0.268165 hartree
zpe.thermalcorrener: 0.282080 hartree
zpe.thermalcorrenthalpy: 0.283024 hartree
zpe.thermalcorrgfe: 0.226795 hartree
zpe.sumelectzpe: -745.726266 hartree
zpe.sumelectthermal: -745.712352 hartree
zpe.sumelectthermalent: -745.711407 hartree
zpe.sumelectthermalfe: -745.767636 hartree
dipole: -0.7373 -2.2063 -1.0736
dipole: 2.5620
quadrupole: -84.8344 -82.9950 -90.8445
quadrupole: 7.5295 3.4543 -4.0811
quadrupole: 1.3903 3.2296 -4.6198 7.5295 3.4543 -4.0811
hfenergy: -745.9944312 hartree
pointgroup: C01 [X(C10H17N1O4)]
dipole: -0.3520577 -0.9150398 -0.2340353 debye
polarizability: 136.9959983|-2.1986159|123.6585929|-9.9569869|-1.3706817|107.2342196 unknown
InChI: InChI=1S/C10H17NO4/c11-9(12)13-6-8-7-14-10(15-8)4-2-1-3-5-10/h8H,1-7,11H2
charge 0 multiplicity 1
32 atoms
O  0.335901 -0.010133 -0.482134
O  1.407902 2.017745 0.128429
O  -2.687125 -0.501898 -0.503285
O  -3.714133 0.545827 1.348525
N  -4.12655 -1.698593 0.782599
C  1.646424 0.553506 -0.077902
C  2.130097 -0.055759 1.250506
C  2.636437 0.334954 -1.227596
C  2.492817 -1.551068 1.080782
C  2.994678 -1.163039 -1.38788
C  3.520853 -1.755276 -0.057984
C  -0.700385 0.903207 0.052748
C  -0.024963 2.286352 -0.092569
C  -1.969476 0.761172 -0.780945
C  -3.535977 -0.466182 0.623907
H  1.348004 0.0782 2.02116
H  3.016639 0.519429 1.581357
H  3.547165 0.921367 -0.999639
H  2.196876 0.743715 -2.155013
H  1.570557 -2.116891 0.843363
H  2.886236 -1.949075 2.035636
H  3.747625 -1.280271 -2.190465
H  2.089008 -1.716802 -1.703222
H  4.475775 -1.258694 0.213686
H  3.741534 -2.832919 -0.181972
H  -0.907322 0.674184 1.116575
H  -0.181712 2.703926 -1.108374
H  -0.358975 3.011849 0.667362
H  -1.71659 0.705266 -1.851216
H  -2.647994 1.609506 -0.575838
H  -3.910324 -2.458126 0.141478
H  -4.773702 -1.835078 1.553522
