program: Orca
programVersion: 4.2.1
elementType: Zn Zn O C C C H H N H C H H C H H N H C H H C C O C C H H N H C H H C H H N H C H H C C H C H C H C H O C O C H H H C C C C O C C C H C H C H H C H H H H H H H H H H H H C O O I
elementType: I
charge: 0
multiplicity: 1
keywords: RKS BP86 D3BJ def2-TZVP def2/J SlowConv TightSCF NoFinalGrid Grid6
formula: C31H43IN4O7Zn2
InChI: InChI=1S/C22H30N4O2.C9H13O5.HI.2Zn/c27-21-17-5-1-6-18(21)14-24-10-4-12-26-16-20-8-2-7-19(22(20)28)15-25-11-3-9-23-13-17;1-6(10)13-7-4-2-3-5-8(7)14-9(11)12;;;/h1-2,5-8,23-26H,3-4,9-16H2;7-8H,2-5H2,1H3;1H;;/q;;;;+1/p-1
88 atoms
Zn -2.066942 1.836156 0.083987
Zn -0.070187 -0.524683 -0.371489
O  -1.948283 -0.159569 0.4506
C  -2.922281 -1.022762 0.732125
C  -4.043591 -0.60049 1.510864
C  -4.0962 0.810702 2.020824
H  -5.029069 0.945808 2.609211
H  -3.242955 1.023511 2.70248
N  -4.046241 1.813769 0.915837
H  -4.56631 1.416156 0.117735
C  -4.720421 3.081512 1.297946
H  -4.56575 3.223184 2.387868
H  -5.816936 2.976836 1.145228
C  -2.790705 4.713528 1.048259
H  -2.594931 5.790001 0.843716
H  -2.724116 4.583815 2.149207
N  -1.714078 3.900949 0.437596
H  -1.598586 4.228053 -0.535771
C  -0.406976 4.102095 1.124185
H  -0.391989 3.445855 2.021065
H  -0.323726 5.153304 1.475793
C  0.728422 3.792318 0.19338
C  0.865084 2.461962 -0.308223
O  0.019641 1.512518 0.110208
C  1.92545 2.20107 -1.225641
C  2.175562 0.819537 -1.76387
H  2.693385 0.20887 -0.99302
H  2.868253 0.899135 -2.631291
N  0.938127 0.109533 -2.169483
H  0.261239 0.804784 -2.536971
C  1.212078 -0.860817 -3.248805
H  1.995309 -1.561335 -2.887939
H  1.65045 -0.326336 -4.123751
C  -0.553044 -2.625358 -2.646569
H  -1.251038 -3.349594 -3.129246
H  0.279203 -3.22738 -2.22279
N  -1.229971 -1.948794 -1.528898
H  -2.016903 -1.396177 -1.908187
C  -1.751991 -2.91986 -0.54232
H  -0.897322 -3.227182 0.100347
H  -2.098366 -3.843019 -1.060961
C  -2.895893 -2.37724 0.275478
C  -3.955207 -3.244365 0.601703
H  -3.915455 -4.281112 0.22893
C  -5.083126 -1.495533 1.816785
H  -5.932476 -1.134699 2.419825
C  1.623442 4.803572 -0.193826
H  1.487267 5.818031 0.215197
C  2.803622 3.237782 -1.594763
H  3.612459 3.008625 -2.307796
O  3.438283 -0.523425 1.010691
C  3.266582 0.009824 2.259127
O  3.439083 -0.617469 3.287423
C  2.799775 1.43655 2.167426
H  2.9662 1.954233 3.128732
H  1.711316 1.408823 1.94988
H  3.290198 1.978704 1.337817
C  -4.187248 4.314332 0.574049
C  -0.018077 -1.647002 -3.687493
C  -5.048509 -2.825347 1.373326
C  2.674011 4.536833 -1.08377
O  1.150936 -1.930672 0.391915
C  2.415004 -2.425213 -0.036096
C  3.537134 -1.965065 0.90703
C  2.457366 -3.948381 -0.212999
H  2.607632 -1.955873 -1.027952
C  4.911775 -2.382311 0.38935
H  3.364576 -2.387874 1.916545
C  3.83476 -4.39655 -0.724819
H  1.654551 -4.250176 -0.918873
H  2.222185 -4.415522 0.764415
C  4.964857 -3.906465 0.194814
H  5.108782 -1.866519 -0.577047
H  5.690836 -2.044393 1.103503
H  3.865688 -5.502385 -0.818686
H  3.997467 -3.990942 -1.749798
H  5.954346 -4.202285 -0.212407
H  4.870706 -4.403029 1.185935
H  -5.86502 -3.521668 1.614926
H  -4.879348 5.155885 0.783776
H  -4.201299 4.169348 -0.528777
H  0.255707 -2.222295 -4.59568
H  -0.825898 -0.946684 -3.99758
H  3.372756 5.331003 -1.38541
C  0.681818 -2.108721 1.982972
O  1.073677 -3.147474 2.477346
O  0.009961 -1.116074 2.227792
I  -2.440495 1.757617 -2.576176
elementType: Zn O C H N I
totalener: -5810.97985280 hartree
nucrepener: 9218.45551214 hartree
cpcmener: -0.03393024 hartree
kineticenergy: 5610.85646585 hartree
exchangeener: -421.711192273502 hartree
correlationener: -16.029995790651 hartree
xcener: -437.741188064153 hartree
chargesum: -0.0000000
charge: 0.376615 0.709398 -0.523138 0.307566 -0.076418 -0.119133 0.127155 0.155067 -0.192184 0.257865 -0.204052 0.147780 0.139272 -0.170387 0.133803 0.137999 -0.172040 0.259784 -0.123897 0.157455 0.126402 0.023986 0.161437 -0.579318 0.032108 -0.062170 0.146413 0.111695 -0.245235 0.227938 -0.154920 0.153164 0.123578 -0.116758 0.120173 0.117721 -0.214954 0.240714 -0.148112 0.161487 0.115184 -0.021188 -0.220192 0.120352 -0.199810 0.120343 -0.216245 0.121137 -0.239540 0.119278 -0.243773 0.284048 -0.325949 -0.386796 0.140060 0.157999 0.139388 -0.178894 -0.276676 -0.190725 -0.170678 -0.396396 0.040855 0.041932 -0.238475 0.028096 -0.222033 0.141160 -0.189403 0.115671 0.137019 -0.190827 0.107051 0.120325 0.112920 0.094326 0.111789 0.106880 0.128064 0.129328 0.155557 0.127579 0.150758 0.130086 0.309087 -0.347666 -0.368034 -0.536834
charge: -0.245152 0.003586 0.131424 -0.230567 -0.144608 -0.231347 0.146042 0.157867 0.085162 0.214064 -0.279016 0.150402 0.140516 -0.277656 0.138957 0.149865 0.086221 0.215233 -0.229215 0.156364 0.145453 -0.146785 -0.245356 0.113071 -0.138519 -0.237475 0.156232 0.145833 0.088755 0.194309 -0.287093 0.141932 0.138075 -0.284545 0.136289 0.145068 0.089309 0.204022 -0.233722 0.160104 0.144300 -0.131393 -0.127930 0.154011 -0.134381 0.152625 -0.131569 0.153532 -0.127463 0.154197 0.288057 -0.503411 0.099025 -0.266536 0.137896 0.159488 0.144284 -0.264106 -0.266102 -0.182069 -0.178565 0.163020 -0.325696 -0.276986 -0.244757 0.150870 -0.241446 0.162450 -0.265309 0.137566 0.150573 -0.261725 0.143600 0.146757 0.141416 0.139602 0.140921 0.145584 0.148896 0.157011 0.155308 0.157471 0.149607 0.149612 -0.649043 0.058260 0.099696 -0.130242
qa: 0.3766 0.7094 -0.5231 0.3076 -0.0764 -0.1191 0.1272 0.1551 -0.1922 0.2579 -0.2041 0.1478 0.1393 -0.1704 0.1338 0.1380 -0.1720 0.2598 -0.1239 0.1575 0.1264 0.0240 0.1614 -0.5793 0.0321 -0.0622 0.1464 0.1117 -0.2452 0.2279 -0.1549 0.1532 0.1236 -0.1168 0.1202 0.1177 -0.2150 0.2407 -0.1481 0.1615 0.1152 -0.0212 -0.2202 0.1204 -0.1998 0.1203 -0.2162 0.1211 -0.2395 0.1193 -0.2438 0.2840 -0.3259 -0.3868 0.1401 0.1580 0.1394 -0.1789 -0.2767 -0.1907 -0.1707 -0.3964 0.0409 0.0419 -0.2385 0.0281 -0.2220 0.1412 -0.1894 0.1157 0.1370 -0.1908 0.1071 0.1203 0.1129 0.0943 0.1118 0.1069 0.1281 0.1293 0.1556 0.1276 0.1508 0.1301 0.3091 -0.3477 -0.3680 -0.5368
va: 2.6351 2.3738 1.8247 3.8932 3.8328 3.8196 0.9666 0.9491 3.1695 0.9298 3.9485 0.9595 0.9601 3.9310 0.9596 0.9611 3.2300 0.9275 3.8191 0.9534 0.9667 3.7388 3.8383 1.7450 3.7161 3.7517 1.0187 0.9726 3.1007 0.9571 3.8705 0.9565 0.9668 3.8807 0.9640 0.9745 3.0517 0.9394 3.8426 0.9895 0.9666 3.8134 3.9110 0.9740 3.8877 0.9731 3.9182 0.9715 3.9397 0.9754 2.1162 4.2406 2.1740 3.8462 0.9743 0.9943 0.9713 3.8883 4.0753 3.8920 3.8527 1.9518 4.0157 3.7334 3.9147 0.9932 3.9660 1.0257 3.9625 0.9663 1.0013 3.9494 0.9721 0.9727 0.9621 0.9689 0.9621 0.9695 0.9681 0.9673 0.9640 0.9714 0.9628 0.9674 4.4019 2.1699 2.1266 0.8899
dispcorr: -0.252859613 hartree
energy: -5811.232712414391
dipole: 170.12771 -171.70819 -1.58049 -121.57034 124.21747 2.64713 171.56753 -173.92467 -2.35715
magnitude: 3.88090 au
magnitude: 9.86446 debye
