program: Orca
programVersion: 4.2.1
elementType: Zn Zn O C C C H H N H C H H C H H N H C H H C C O C C H H N H C H H C H H N H C H H C C H C H C H C H O C O C H H H C C C C O C C C H C H C H H C H H H H H H H H H H H H C O O I
elementType: I
charge: 0
multiplicity: 1
keywords: RKS BP86 D3BJ def2-SVP def2/J SlowConv TightSCF Grid6 OptTS Freq
frequency: 0.00 0.00 0.00 0.00 0.00 0.00 -75.19 12.25 14.86 20.15 25.03 30.87 36.31 41.30 51.70 53.98 55.71 68.20 71.73 76.94 83.75 89.25 91.01 102.32 107.63 111.04 115.75 128.85 137.25 144.50 148.00 153.95 160.26 174.26 177.33 184.29 191.33 193.90 213.46 227.60 230.41 233.25 242.13 249.76 259.22 270.45 278.01 279.91 293.09 301.17 307.34 308.74 309.20 319.72 324.78 327.72 336.24 338.12 344.85 355.50 358.12 365.46 368.90 410.59 416.67 430.16 436.00 442.03 452.69 456.02 464.15 465.45 504.37 523.12 536.19 539.43 546.25 551.05 562.57 564.83 570.21 576.74 582.14 625.37 630.43 642.81 647.67 680.36 708.37 715.66 740.22 742.16 744.96 763.18 772.16 779.16 808.41 817.43 826.09 841.26 844.77 851.78 858.72 867.89 880.60 882.64 885.64 889.02 902.35 910.56 913.34 921.42 923.37 929.29 940.66 945.00 946.21 949.79 950.78 973.30 978.43 978.59 992.68 1007.28 1008.80 1018.25 1023.99 1024.76 1030.21 1030.86 1035.77 1035.95 1040.48 1057.94 1060.66 1069.98 1082.25 1083.27 1086.40 1090.47 1096.74 1105.44 1111.79 1117.64 1124.82 1124.94 1129.29 1131.60 1134.10 1169.13 1172.66 1186.05 1204.05 1208.18 1209.11 1215.45 1216.95 1217.73 1218.31 1224.63 1233.44 1243.22 1245.04 1253.25 1256.24 1262.31 1266.96 1272.36 1279.41 1286.61 1290.28 1297.77 1305.22 1310.33 1311.77 1314.72 1315.90 1317.98 1323.63 1323.89 1326.52 1328.52 1334.82 1342.67 1355.55 1362.86 1364.75 1367.99 1369.31 1371.64 1373.15 1380.15 1384.10 1388.88 1391.95 1394.15 1400.16 1401.98 1408.40 1408.96 1410.30 1412.77 1415.29 1417.72 1419.97 1421.44 1423.71 1424.58 1427.67 1431.80 1437.05 1450.59 1463.38 1465.89 1467.79 1584.14 1586.83 1606.54 1609.71 1777.51 1980.03 2915.50 2921.94 2925.15 2935.66 2935.98 2937.72 2942.56 2943.53 2947.61 2951.31 2954.10 2955.51 2957.75 2966.37 2971.43 2974.96 2979.48 2992.07 2994.53 2995.66 2999.12 3000.40 3003.45 3005.64 3010.13 3013.04 3014.56 3024.68 3025.73 3027.86 3038.09 3068.32 3085.96 3087.25 3089.00 3090.55 3107.46 3122.60 3122.95 3276.44 3347.08 3352.98 3368.01
frequency: 12.25 14.86 20.15 25.03 30.87 36.31 41.30 51.70 53.98 55.71 68.20 71.73 76.94 83.75 89.25 91.01 102.32 107.63 111.04 115.75 128.85 137.25 144.50 148.00 153.95 160.26 174.26 177.33 184.29 191.33 193.90 213.46 227.60 230.41 233.25 242.13 249.76 259.22 270.45 278.01 279.91 293.09 301.17 307.34 308.74 309.20 319.72 324.78 327.72 336.24 338.12 344.85 355.50 358.12 365.46 368.90 410.59 416.67 430.16 436.00 442.03 452.69 456.02 464.15 465.45 504.37 523.12 536.19 539.43 546.25 551.05 562.57 564.83 570.21 576.74 582.14 625.37 630.43 642.81 647.67 680.36 708.37 715.66 740.22 742.16 744.96 763.18 772.16 779.16 808.41 817.43 826.09 841.26 844.77 851.78 858.72 867.89 880.60 882.64 885.64 889.02 902.35 910.56 913.34 921.42 923.37 929.29 940.66 945.00 946.21 949.79 950.78 973.30 978.43 978.59 992.68 1007.28 1008.80 1018.25 1023.99 1024.76 1030.21 1030.86 1035.77 1035.95 1040.48 1057.94 1060.66 1069.98 1082.25 1083.27 1086.40 1090.47 1096.74 1105.44 1111.79 1117.64 1124.82 1124.94 1129.29 1131.60 1134.10 1169.13 1172.66 1186.05 1204.05 1208.18 1209.11 1215.45 1216.95 1217.73 1218.31 1224.63 1233.44 1243.22 1245.04 1253.25 1256.24 1262.31 1266.96 1272.36 1279.41 1286.61 1290.28 1297.77 1305.22 1310.33 1311.77 1314.72 1315.90 1317.98 1323.63 1323.89 1326.52 1328.52 1334.82 1342.67 1355.55 1362.86 1364.75 1367.99 1369.31 1371.64 1373.15 1380.15 1384.10 1388.88 1391.95 1394.15 1400.16 1401.98 1408.40 1408.96 1410.30 1412.77 1415.29 1417.72 1419.97 1421.44 1423.71 1424.58 1427.67 1431.80 1437.05 1450.59 1463.38 1465.89 1467.79 1584.14 1586.83 1606.54 1609.71 1777.51 1980.03 2915.50 2921.94 2925.15 2935.66 2935.98 2937.72 2942.56 2943.53 2947.61 2951.31 2954.10 2955.51 2957.75 2966.37 2971.43 2974.96 2979.48 2992.07 2994.53 2995.66 2999.12 3000.40 3003.45 3005.64 3010.13 3013.04 3014.56 3024.68 3025.73 3027.86 3038.09 3068.32 3085.96 3087.25 3089.00 3090.55 3107.46 3122.60 3122.95 3276.44 3347.08 3352.98 3368.01
formula: C31H43IN4O7Zn2
InChI: InChI=1S/C22H30N4O2.C9H13O5.HI.2Zn/c27-21-17-5-1-6-18(21)14-24-10-4-12-26-16-20-8-2-7-19(22(20)28)15-25-11-3-9-23-13-17;1-6(10)13-7-4-2-3-5-8(7)14-9(11)12;;;/h1-2,5-8,23-26H,3-4,9-16H2;7-8H,2-5H2,1H3;1H;;/q;;;;+1/p-1
88 atoms
Zn -2.066942 1.836156 0.083987
Zn -0.070187 -0.524683 -0.371489
O  -1.948283 -0.159569 0.4506
C  -2.922281 -1.022762 0.732125
C  -4.043591 -0.60049 1.510864
C  -4.0962 0.810702 2.020824
H  -5.029069 0.945808 2.609211
H  -3.242955 1.023511 2.70248
N  -4.046241 1.813769 0.915837
H  -4.56631 1.416156 0.117735
C  -4.720421 3.081512 1.297946
H  -4.56575 3.223184 2.387868
H  -5.816936 2.976836 1.145228
C  -2.790705 4.713528 1.048259
H  -2.594931 5.790001 0.843716
H  -2.724116 4.583815 2.149207
N  -1.714078 3.900949 0.437596
H  -1.598586 4.228053 -0.535771
C  -0.406976 4.102095 1.124185
H  -0.391989 3.445855 2.021065
H  -0.323726 5.153304 1.475793
C  0.728422 3.792318 0.19338
C  0.865084 2.461962 -0.308223
O  0.019641 1.512518 0.110208
C  1.92545 2.20107 -1.225641
C  2.175562 0.819537 -1.76387
H  2.693385 0.20887 -0.99302
H  2.868253 0.899135 -2.631291
N  0.938127 0.109533 -2.169483
H  0.261239 0.804784 -2.536971
C  1.212078 -0.860817 -3.248805
H  1.995309 -1.561335 -2.887939
H  1.65045 -0.326336 -4.123751
C  -0.553044 -2.625358 -2.646569
H  -1.251038 -3.349594 -3.129246
H  0.279203 -3.22738 -2.22279
N  -1.229971 -1.948794 -1.528898
H  -2.016903 -1.396177 -1.908187
C  -1.751991 -2.91986 -0.54232
H  -0.897322 -3.227182 0.100347
H  -2.098366 -3.843019 -1.060961
C  -2.895893 -2.37724 0.275478
C  -3.955207 -3.244365 0.601703
H  -3.915455 -4.281112 0.22893
C  -5.083126 -1.495533 1.816785
H  -5.932476 -1.134699 2.419825
C  1.623442 4.803572 -0.193826
H  1.487267 5.818031 0.215197
C  2.803622 3.237782 -1.594763
H  3.612459 3.008625 -2.307796
O  3.438283 -0.523425 1.010691
C  3.266582 0.009824 2.259127
O  3.439083 -0.617469 3.287423
C  2.799775 1.43655 2.167426
H  2.9662 1.954233 3.128732
H  1.711316 1.408823 1.94988
H  3.290198 1.978704 1.337817
C  -4.187248 4.314332 0.574049
C  -0.018077 -1.647002 -3.687493
C  -5.048509 -2.825347 1.373326
C  2.674011 4.536833 -1.08377
O  1.150936 -1.930672 0.391915
C  2.415004 -2.425213 -0.036096
C  3.537134 -1.965065 0.90703
C  2.457366 -3.948381 -0.212999
H  2.607632 -1.955873 -1.027952
C  4.911775 -2.382311 0.38935
H  3.364576 -2.387874 1.916545
C  3.83476 -4.39655 -0.724819
H  1.654551 -4.250176 -0.918873
H  2.222185 -4.415522 0.764415
C  4.964857 -3.906465 0.194814
H  5.108782 -1.866519 -0.577047
H  5.690836 -2.044393 1.103503
H  3.865688 -5.502385 -0.818686
H  3.997467 -3.990942 -1.749798
H  5.954346 -4.202285 -0.212407
H  4.870706 -4.403029 1.185935
H  -5.86502 -3.521668 1.614926
H  -4.879348 5.155885 0.783776
H  -4.201299 4.169348 -0.528777
H  0.255707 -2.222295 -4.59568
H  -0.825898 -0.946684 -3.99758
H  3.372756 5.331003 -1.38541
C  0.681818 -2.108721 1.982972
O  1.073677 -3.147474 2.477346
O  0.009961 -1.116074 2.227792
I  -2.440495 1.757617 -2.576176
totalener: -5808.34298185 hartree
nucrepener: 9213.95199716 hartree
cpcmener: -0.02669817 hartree
kineticenergy: 5594.35225492 hartree
exchangeener: -421.035303755428 hartree
correlationener: -16.061940932902 hartree
xcener: -437.097244688330 hartree
temp: 393.15 k
press: 1.00 atm
thermalcorrenthalpy: 0.00124506 hartree
totalenthalpy: -5807.81345747 hartree
elementType: Zn O C H N I
chargesum: -0.0000000
charge: 0.617981 0.767114 -0.448437 0.253002 -0.163264 0.167607 0.023916 0.066877 -0.313048 0.172353 0.050722 0.046104 0.050507 0.057946 0.046455 0.043117 -0.317049 0.170642 0.183916 0.062460 0.021325 -0.141984 0.198708 -0.452816 -0.131855 0.163780 0.060507 0.017040 -0.323329 0.162550 0.052406 0.043302 0.035841 0.070044 0.032886 0.031049 -0.323439 0.161508 0.160313 0.065489 0.017400 -0.135112 -0.060158 -0.000735 -0.055939 -0.002864 -0.055846 -0.001174 -0.057120 -0.000047 -0.275671 0.092677 -0.219258 -0.021755 0.047265 0.096120 0.058786 -0.018645 -0.018182 -0.032151 -0.029026 -0.478470 0.133603 0.041418 0.031130 -0.012248 0.048954 0.039022 -0.038696 0.023346 0.026248 -0.028797 0.011664 0.027208 0.025683 0.011341 0.026234 0.024767 0.004771 0.045845 0.046313 0.042165 0.040795 0.006745 0.220302 -0.255473 -0.268935 -0.565742
charge: 0.510446 0.632345 -0.273380 0.034332 -0.094270 0.029948 0.030217 0.039709 -0.047073 0.089805 0.023156 0.034855 0.032983 0.022144 0.030769 0.034481 -0.038935 0.087556 0.031857 0.038416 0.029829 -0.091405 0.024203 -0.288867 -0.081226 0.021268 0.028205 0.028548 -0.046343 0.061124 0.020248 0.026545 0.026768 0.018550 0.024948 0.028489 -0.043045 0.075065 0.023703 0.035672 0.027296 -0.083878 -0.034512 0.034303 -0.039322 0.033180 -0.037823 0.034297 -0.034283 0.034721 -0.077301 0.072389 -0.174550 -0.095013 0.045148 0.059669 0.047532 -0.060909 -0.055311 -0.077663 -0.073763 -0.236174 0.039630 0.047419 -0.053536 0.011013 -0.046243 0.021304 -0.046506 0.025251 0.030444 -0.044084 0.025849 0.035178 0.031990 0.023553 0.031750 0.031666 0.034479 0.049962 0.037491 0.048762 0.033466 0.035477 0.030633 -0.216067 -0.223927 -0.474626
qa: 0.6180 0.7671 -0.4484 0.2530 -0.1633 0.1676 0.0239 0.0669 -0.3130 0.1724 0.0507 0.0461 0.0505 0.0579 0.0465 0.0431 -0.3170 0.1706 0.1839 0.0625 0.0213 -0.1420 0.1987 -0.4528 -0.1319 0.1638 0.0605 0.0170 -0.3233 0.1625 0.0524 0.0433 0.0358 0.0700 0.0329 0.0310 -0.3234 0.1615 0.1603 0.0655 0.0174 -0.1351 -0.0602 -0.0007 -0.0559 -0.0029 -0.0558 -0.0012 -0.0571 -0.0000 -0.2757 0.0927 -0.2193 -0.0218 0.0473 0.0961 0.0588 -0.0186 -0.0182 -0.0322 -0.0290 -0.4785 0.1336 0.0414 0.0311 -0.0122 0.0490 0.0390 -0.0387 0.0233 0.0262 -0.0288 0.0117 0.0272 0.0257 0.0113 0.0262 0.0248 0.0048 0.0458 0.0463 0.0422 0.0408 0.0067 0.2203 -0.2555 -0.2689 -0.5657
va: 2.4167 2.2861 2.1643 3.9470 3.9579 3.8706 0.9962 0.9889 3.3186 0.9801 4.0563 0.9933 0.9778 4.0246 0.9792 0.9948 3.3358 0.9836 3.8678 0.9938 0.9970 3.9413 3.9678 2.1451 3.9455 3.8420 1.0542 1.0021 3.2927 1.0023 4.0458 0.9961 0.9802 4.0210 0.9807 1.0122 3.2896 0.9919 3.8500 1.0260 1.0003 3.9543 3.8462 0.9887 3.8302 0.9883 3.8233 0.9882 3.8476 0.9893 2.2078 4.3940 2.2895 3.8793 1.0049 1.0430 1.0053 4.0421 4.0911 3.7625 3.7584 2.0709 4.0762 4.0188 4.0233 1.0011 4.0569 1.0629 4.1200 0.9944 1.0325 4.1191 0.9925 0.9841 0.9745 0.9809 0.9746 0.9819 0.9795 0.9829 1.0061 0.9827 1.0039 0.9796 4.3580 2.2730 2.2500 0.8382
dispcorr: -0.252859609 hartree
energy: -5808.597906626410
dipole: 170.12770 -171.77787 -1.65017 -121.57032 124.23768 2.66736 171.56753 -173.78170 -2.21417
magnitude: 3.83932 au
magnitude: 9.75879 debye
zeropoint: 0.70718339 hartree
thermalvibcorrection: 0.07175046 hartree
thermalrotcorrection: 0.00186754 hartree
thermaltrasncorrection: 0.00186754 hartree
thermaltotal: -5807.81523769 hartree
thermalcorr: 0.07548554 hartree
nonthermalcorr: 0.70718339 hartree
totalcorr: 0.78266893 hartree
totalenthalpy: -5807.81399263 hartree
