program: Orca
programVersion: 4.2.1
elementType: O C O O C C H H C H H C H H H C H H C H
charge: 0
multiplicity: 1
keywords: RKS BP86 D3BJ def2-TZVP def2/J SlowConv TightSCF NoFinalGrid Grid6
formula: C7H10O3
InChI: InChI=1S/C7H10O3/c8-7-9-5-3-1-2-4-6(5)10-7/h5-6H,1-4H2
20 atoms
O  0.603798 0.215298 -3.717203
C  0.607885 -0.471549 -2.72647
O  1.688296 -0.662825 -1.924559
O  -0.466371 -1.16462 -2.264266
C  -0.167073 -1.762682 -0.976485
C  1.379484 -1.622281 -0.879187
H  -0.478691 -2.823775 -1.028479
H  1.886937 -2.573283 -1.142722
C  1.851245 -1.108098 0.473141
H  1.601654 -1.898782 1.212629
H  2.957113 -1.028187 0.474534
C  1.20059 0.23472 0.867965
H  1.785421 1.070035 0.433663
H  1.275093 0.347335 1.968944
H  -0.876486 0.892271 1.172688
C  -0.278991 0.349433 0.413062
H  -0.349515 0.963471 -0.510388
H  -1.975296 -0.926131 -0.154478
C  -0.909314 -1.021841 0.136543
H  -0.888184 -1.655305 1.049157
elementType: O C H
totalener: -498.67612053 hartree
nucrepener: 579.40646042 hartree
electener: -1078.08258095 hartree
oneelecener: -1827.83136391 hartree
twoeener: 749.74878297 hartree
cpcmener: -0.00919397 hartree
kineticenergy: 496.29938304 hartree
exchangeener: -64.764313064113 hartree
correlationener: -2.802803510938 hartree
xcener: -67.567116575051 hartree
chargesum: -0.0000000
charge: -0.300519 0.280604 -0.232875 -0.225797 0.033303 0.107035 0.121007 0.119715 -0.228279 0.119365 0.130873 -0.212856 0.116257 0.115741 0.118779 -0.259294 0.129246 0.125590 -0.172205 0.114313
charge: 0.093061 -0.637495 0.283999 0.282435 -0.253648 -0.253099 0.155318 0.153430 -0.244092 0.156177 0.150298 -0.260040 0.144008 0.142364 0.142678 -0.261128 0.145668 0.151350 -0.244480 0.153197
qa: -0.3005 0.2806 -0.2329 -0.2258 0.0333 0.1070 0.1210 0.1197 -0.2283 0.1194 0.1309 -0.2129 0.1163 0.1157 0.1188 -0.2593 0.1292 0.1256 -0.1722 0.1143
va: 2.2204 4.5713 2.1751 2.1780 3.9518 3.8204 0.9601 0.9590 3.9502 0.9662 0.9670 3.9456 0.9703 0.9625 0.9625 3.9998 0.9639 0.9767 3.9250 0.9685
dispcorr: -0.031691578 hartree
energy: -498.707812107311
dipole: -0.54113 0.51459 -0.02653 -0.66128 -0.58044 -1.24172 13.44238 -11.11469 2.32769
magnitude: 2.63831 au
magnitude: 6.70606 debye
