program: Gaussian 09
title: 000003051
version: EM64L-G09RevD.01
frameworkgroup: C1[X(C6H10O5)]
method: RPBEPBE
basis: SDD
operation: Freq
keyword: #pfreq=noraman
keyword: PBEPBE/SDD
title: #p freq=noraman PBEPBE/SDD
converged: YES YES NO YES
title: Mulliken charges:
elementType: O O O O O C C C C C C H H H H H H H H H H
charge: -0.232003 -0.232002 -0.252073 -0.200958 -0.200960 -0.241730 -0.241730 -0.666838 -0.666838 0.308175 0.308177 0.236115 0.236106 0.236114 0.236107 0.214565 0.236301 0.236303 0.214565 0.236301 0.236303
chargesum: 0.00000
title: Mulliken charges with hydrogens summed into heavy atoms:
elementType: O O O O O C C C C C C
charge: -0.232003 -0.232002 -0.252073 -0.200958 -0.200960 0.230491 0.230491 0.020331 0.020330 0.308175 0.308177
polarizability: 1.24015848e+02 -2.23155212e-05 8.04875648e+01 -2.20876070e-03 -6.01261856e-04 5.54374043e+01
1716.lowfreq: -42.5341 -0.0011 -0.0004 0.0001 3.6791 4.8863 5.5179 42.9245 44.9245
frequency: -42.5312 42.8833 44.8905 59.6435 77.5993 123.7276 163.3628 164.0730 233.6708 246.7867 248.4785 301.1259 333.7804 385.5614 423.9434 648.6248 683.8456 686.4338 690.4401 800.2840 801.8281 802.0332 840.5865 865.4513 988.6565 1024.6111 1043.6794 1071.8356 1115.3375 1116.5303 1136.6067 1136.7621 1187.6408 1254.5848 1254.6321 1357.0968 1358.9516 1404.2648 1404.5429 1462.0273 1462.0498 1472.8196 1473.0638 1486.0383 1486.2209 1636.2972 1699.4203 3000.9682 3001.0233 3013.1197 3013.2364 3075.4498 3075.4838 3097.9402 3098.0108 3115.0277 3115.0949
redmass: 9.8240 4.8931 2.2167 2.2287 4.0043 2.5477 4.2631 3.4702 6.4135 1.2296 1.2944 5.0122 5.0398 3.8907 4.9263 9.1168 11.7802 8.1943 11.7865 4.1251 1.0992 1.1003 6.8657 5.0286 2.6933 2.3707 13.1092 4.8738 2.2908 2.2832 1.4558 1.4560 8.4386 1.1324 1.1318 1.3370 1.3524 1.2580 1.2612 1.0391 1.0391 1.0636 1.0631 1.0677 1.0670 11.5814 11.8491 1.0361 1.0361 1.0579 1.0580 1.1076 1.1076 1.0984 1.0984 1.1028 1.1028
irintensity: 0.0000 0.4900 0.0000 5.8656 3.5743 0.0000 5.5892 3.0244 0.0024 0.0000 1.2967 0.5500 35.1997 0.8240 2.7345 4.5972 0.0000 0.4962 39.0893 53.7067 0.0000 7.8872 14.2882 5.5852 328.8240 0.0784 1457.4305 581.9922 11.4745 38.3022 12.3671 0.0003 49.9617 0.0165 0.0000 0.0617 5.6156 20.6194 31.2126 0.0000 25.3728 7.3069 2.3400 6.0403 27.7245 6.0203 480.1061 16.3282 15.8676 16.1144 19.9079 0.0370 16.1054 28.7351 21.6015 0.0463 76.1331
temp: 298.150 k
press: 1.00000 atm
elementType: 8 8 8 8 8 6 6 6 6 6 6 1 1 1 1 1 1 1 1 1 1
symmnumber: 1
zpe: 420535.7 jmol-1
zpe.correction: 0.160174 hartree
zpe.thermalcorrener: 0.172311 hartree
zpe.thermalcorrenthalpy: 0.173255 hartree
zpe.thermalcorrgfe: 0.120136 hartree
zpe.sumelectzpe: -609.871749 hartree
zpe.sumelectthermal: -609.859612 hartree
zpe.sumelectthermalent: -609.858668 hartree
zpe.sumelectthermalfe: -609.911787 hartree
dipole: 0.0000 1.9740 0.0001
dipole: 1.9740
quadrupole: -34.6603 -75.9977 -61.7536
quadrupole: 0.0000 -0.0001 0.0006
quadrupole: 22.8103 -18.5272 -4.2831 0.0000 -0.0001 0.0006
hfenergy: -610.0319229 hartree
pointgroup: C01 [X(C6H10O5)]
dipole: 0.0000081 0.776635 -0.0000471 debye
dipolederiv: -1.718947 0.4225614 -0.0000089 0.639218 -0.6732948 -0.0000886 -0.0003163 0.0001358 -0.276795 -1.7189439 -0.4225572 0.0000491 -0.6392031 -0.6732892 0.0000864 -0.0001491 -0.0000973 -0.276793 -2.7457214 -0.0000043 0.0002722 -0.0000243 -0.4917727 -0.0000343 0.0013197 -0.0000044 -0.1998047 -0.7415118 -0.0988544 0.0000729 -0.0961768 -0.9071298 0.0003016 0.0000274 -0.0003499 -0.2871494 -0.7415119 0.0988532 0.0000817 0.0961786 -0.9071213 -0.0002521 0.0000615 0.0002249 -0.2871484 1.0826046 -0.1685777 0.0001014 0.0336654 0.240548 0.0000093 0.0000379 -0.0000202 0.3530129 1.0826084 0.1685772 0.0000391 -0.0336743 0.2405462 -0.0000155 -0.0000473 -0.0000081 0.3530125 -0.0972504 0.0970156 -0.000013 0.07675 -0.0353452 0.0000201 -0.0000238 0.0000178 0.0534322 -0.0972532 -0.0970161 -0.0000101 -0.0767491 -0.035343 -0.0000253 -0.0000196 -0.0000236 0.0534326 2.8773619 -0.1347149 -0.0003173 0.0296041 1.5178519 -0.0002856 -0.0004793 0.0001566 0.3548452 2.8773514 0.1347176 -0.0003533 -0.0295894 1.5178372 0.000271 -0.0005415 -0.0000563 0.3548432 -0.0569923 0.0376158 0.0120352 -0.051781 0.0059346 -0.09127 -0.0240637 -0.0994963 -0.0535634 -0.0569343 0.0375372 -0.0119994 -0.0518704 0.0059328 0.091263 0.0241124 0.0995179 -0.0535595 -0.0569852 -0.0375991 0.0120268 0.051803 0.0059117 0.0912718 -0.0240615 0.0995072 -0.0535358 -0.0569395 -0.0375546 -0.0120091 0.0518495 0.005956 -0.0912614 0.024114 -0.0995067 -0.0535871 -0.1509256 -0.0386454 -0.0000565 -0.0565825 0.0611377 -0.0000183 -0.0000685 -0.0000102 0.1205531 0.1177482 -0.0330387 -0.0492483 0.0202949 0.0151281 -0.0915155 -0.0275855 -0.108768 -0.0554592 0.1177091 -0.0330913 0.0493188 0.0202485 0.0151236 0.0915246 0.0276699 0.108754 -0.0554152 -0.1509246 0.0386468 -0.0000213 0.056584 0.0611368 0.0000053 -0.0000266 0.0000007 0.1205533 0.1177372 0.0330555 -0.049263 -0.0202825 0.0151028 0.0915272 -0.027607 0.1087743 -0.0554264 0.1177205 0.0330734 0.0493031 -0.0202622 0.0151485 -0.0915137 0.027647 -0.1087483 -0.055448 unknown
polarizability: 124.0158475|0.0000378|80.4875648|-0.0022088|0.0006013|55.4374043 unknown
InChI: InChI=1S/C6H10O5/c1-3-9-5(7)11-6(8)10-4-2/h3-4H2,1-2H3
charge 0 multiplicity 1
21 atoms
O  -2.187344 0.494475 0.000943
O  2.187356 0.494484 0.000201
O  -0.000003 0.193899 0.000597
O  -1.430977 -1.726262 0.000655
O  1.430985 -1.726258 0.000334
C  -3.609169 0.007326 0.000568
C  3.609176 0.007328 0.0003
C  -4.486099 1.252698 0.000377
C  4.486113 1.252694 0.00053
C  -1.239336 -0.502222 0.00119
C  1.239343 -0.502214 0.000026
H  -3.756289 -0.62056 -0.896458
H  -3.756733 -0.620599 0.897495
H  3.756427 -0.62068 0.89722
H  3.756602 -0.620479 -0.896732
H  -5.550612 0.95582 0.000124
H  -4.296008 1.868223 0.895492
H  -4.295587 1.868249 -0.894631
H  5.550624 0.955809 0.000625
H  4.295923 1.868328 -0.89449
H  4.295709 1.86814 0.895633
