program: Orca
programVersion: 4.2.1
elementType: Mg Zn O C C C H H N H C H H C H H N H C H H C C O C C H H N H C H H C H H N H C H H C C H C H C H C H O C O C H H H C C C C O C C C H C H C H H C H H H H H H H H H H H H C O O I
elementType: I
charge: 0
multiplicity: 1
keywords: RKS BP86 D3BJ def2-TZVP def2/J SlowConv TightSCF NoFinalGrid Grid6
formula: C31H43IMgN4O7Zn
InChI: InChI=1S/C22H30N4O2.C7H10O3.C2H3O2.I.Mg.Zn/c27-21-17-5-1-6-18(21)14-24-10-4-12-26-16-20-8-2-7-19(22(20)28)15-25-11-3-9-23-13-17;8-7(9)10-6-4-2-1-3-5-6;1-2(3)4;;;/h1-2,5-8,23-26H,3-4,9-16H2;4,6H,1-3,5H2;1H3;;;/q;2*-1;;2*+1
88 atoms
Mg 0.10955 2.029377 -0.028939
Zn -1.096362 -0.628377 0.835657
O  0.276114 0.758238 1.571507
C  0.530583 1.068325 2.846824
C  1.242806 2.266529 3.179103
C  1.743147 3.194502 2.104435
H  2.269349 4.047438 2.58756
H  2.474829 2.683661 1.441539
N  0.649103 3.697685 1.231626
H  -0.181087 3.87796 1.81998
C  1.027496 4.959663 0.564593
H  2.020566 4.801424 0.092924
H  1.161776 5.76271 1.326156
C  0.09828 4.610306 -1.804218
H  -0.393485 5.179007 -2.627519
H  1.161751 4.484212 -2.098832
N  -0.49357 3.259953 -1.710495
H  -1.517916 3.360027 -1.615238
C  -0.206626 2.474129 -2.937679
H  0.84074 2.112416 -2.859134
H  -0.266101 3.132255 -3.833068
C  -1.1443 1.313747 -3.136506
C  -1.305221 0.297616 -2.140789
O  -0.642995 0.359083 -0.975019
C  -2.190081 -0.784474 -2.437462
C  -2.433986 -1.884455 -1.441467
H  -1.529022 -2.513445 -1.296969
H  -3.222334 -2.558519 -1.843002
N  -2.842925 -1.361304 -0.116122
H  -3.414494 -0.509772 -0.25564
C  -3.641519 -2.350616 0.631763
H  -3.056797 -3.294187 0.662244
H  -4.577114 -2.573666 0.06883
C  -2.789247 -1.964637 3.01643
H  -3.149292 -1.947063 4.071194
H  -2.243399 -2.921953 2.880224
N  -1.81627 -0.876018 2.810532
H  -2.264916 0.027388 3.040732
C  -0.619688 -1.059708 3.667473
H  0.028224 -1.804493 3.155585
H  -0.917672 -1.502428 4.644013
C  0.110828 0.228764 3.925749
C  0.384271 0.590933 5.258213
H  0.036054 -0.076718 6.063399
C  1.496291 2.592991 4.523619
H  2.040202 3.526715 4.7415
C  -1.843528 1.226343 -4.354281
H  -1.699437 2.028123 -5.096754
C  -2.869568 -0.836685 -3.669234
H  -3.550199 -1.683161 -3.856724
O  0.932335 -3.594513 -0.732582
C  0.216611 -3.515174 0.312241
O  -0.15827 -2.43663 0.878785
C  -0.222062 -4.82271 0.955698
H  0.250954 -5.695133 0.469417
H  -1.324675 -4.918982 0.875903
H  0.028384 -4.810147 2.035318
C  0.027212 5.407763 -0.501572
C  -3.973527 -1.911016 2.054857
C  1.07874 1.765429 5.575309
C  -2.702161 0.156426 -4.641409
O  2.71041 -0.208437 -0.08986
C  2.688621 -1.611704 -0.469094
C  1.649233 -1.796967 -1.581479
C  4.089948 -2.13476 -0.824371
H  2.322567 -2.098384 0.449654
C  1.914487 -2.48099 -2.896561
H  0.651898 -1.389205 -1.383015
C  4.380698 -2.194733 -2.329996
H  4.179466 -3.160942 -0.407625
H  4.82862 -1.509799 -0.282379
C  3.328725 -3.072134 -3.023527
H  1.140956 -3.257209 -3.050839
H  1.742133 -1.716162 -3.679645
H  4.376472 -1.173511 -2.766904
H  5.396243 -2.612564 -2.491767
H  3.349844 -4.082661 -2.559468
H  3.571402 -3.213032 -4.096683
H  1.283096 2.035514 6.621901
H  0.24354 6.468932 -0.743655
H  -1.007611 5.390197 -0.092407
H  -4.759735 -2.590146 2.444087
H  -4.420961 -0.892071 2.048838
H  -3.240254 0.105678 -5.599467
C  2.292831 0.610766 -1.090239
O  2.116099 0.057079 -2.222081
O  2.075309 1.817754 -0.792907
I  -2.840386 2.26434 0.999214
elementType: Mg Zn O C H N I
totalener: -4231.48244169 hartree
nucrepener: 8474.62394572 hartree
cpcmener: -0.02626892 hartree
kineticenergy: 4033.40807516 hartree
exchangeener: -368.003369676553 hartree
correlationener: -14.887792113066 hartree
xcener: -382.891161789619 hartree
chargesum: 0.0000000
charge: 0.827004 0.540269 -0.653798 0.294028 -0.085537 -0.081189 0.111693 0.173280 -0.361862 0.256859 -0.162709 0.137205 0.123718 -0.167137 0.123863 0.139172 -0.361586 0.259366 -0.065083 0.171526 0.107385 -0.049947 0.326087 -0.747604 0.010507 -0.135551 0.176242 0.116020 -0.180924 0.248948 -0.160421 0.132068 0.125904 -0.139562 0.123486 0.141320 -0.181984 0.254853 -0.088439 0.155541 0.115099 -0.032990 -0.213244 0.118582 -0.205187 0.120951 -0.210563 0.119474 -0.218545 0.118342 -0.400140 0.319609 -0.428927 -0.400856 0.141807 0.142071 0.148178 -0.194433 -0.249347 -0.191397 -0.186452 -0.244945 0.100086 0.144165 -0.217699 0.119919 -0.188659 0.124896 -0.179751 0.113396 0.118213 -0.232570 0.128236 0.142789 0.107153 0.110153 0.104005 0.111377 0.126932 0.124578 0.132543 0.126128 0.149911 0.127313 0.500875 -0.393160 -0.491664 -0.629261
charge: -0.300058 -0.088818 0.115861 -0.221206 -0.129951 -0.230420 0.142467 0.165859 0.072535 0.207008 -0.281766 0.152949 0.134953 -0.282080 0.134984 0.152714 0.072037 0.204322 -0.232247 0.164920 0.141954 -0.124444 -0.226645 0.100726 -0.137543 -0.231173 0.157507 0.146295 0.095173 0.205197 -0.281130 0.146102 0.137956 -0.282669 0.136876 0.150004 0.094157 0.202423 -0.232896 0.158127 0.143631 -0.136789 -0.134172 0.152446 -0.132748 0.152888 -0.129300 0.153341 -0.132369 0.152924 0.121724 -0.582863 0.117121 -0.281277 0.132933 0.136314 0.140386 -0.258089 -0.262015 -0.184324 -0.180831 0.297117 -0.269877 -0.035746 -0.237331 0.166960 -0.255859 0.165457 -0.265917 0.150596 0.149612 -0.260066 0.154359 0.162120 0.142513 0.139991 0.142126 0.141094 0.148344 0.155346 0.154131 0.157026 0.153196 0.148930 -0.684484 0.133342 0.081617 -0.233589
qa: 0.8270 0.5403 -0.6538 0.2940 -0.0855 -0.0812 0.1117 0.1733 -0.3619 0.2569 -0.1627 0.1372 0.1237 -0.1671 0.1239 0.1392 -0.3616 0.2594 -0.0651 0.1715 0.1074 -0.0499 0.3261 -0.7476 0.0105 -0.1356 0.1762 0.1160 -0.1809 0.2489 -0.1604 0.1321 0.1259 -0.1396 0.1235 0.1413 -0.1820 0.2549 -0.0884 0.1555 0.1151 -0.0330 -0.2132 0.1186 -0.2052 0.1210 -0.2106 0.1195 -0.2185 0.1183 -0.4001 0.3196 -0.4289 -0.4009 0.1418 0.1421 0.1482 -0.1944 -0.2493 -0.1914 -0.1865 -0.2449 0.1001 0.1442 -0.2177 0.1199 -0.1887 0.1249 -0.1798 0.1134 0.1182 -0.2326 0.1282 0.1428 0.1072 0.1102 0.1040 0.1114 0.1269 0.1246 0.1325 0.1261 0.1499 0.1273 0.5009 -0.3932 -0.4917 -0.6293
va: 2.0945 2.5989 1.7941 3.8752 3.8670 3.6957 0.9702 0.9731 3.0598 0.9333 3.9389 0.9608 0.9597 3.9427 0.9598 0.9591 3.0627 0.9263 3.6799 0.9872 0.9693 3.8995 3.6971 1.6588 3.7726 3.8354 0.9528 0.9714 3.1375 0.9391 3.9167 0.9559 0.9644 3.8581 0.9618 0.9539 3.1455 0.9253 3.7478 0.9794 0.9675 3.8132 3.8966 0.9739 3.8895 0.9730 3.8975 0.9735 3.8974 0.9744 2.1597 4.1223 1.9765 3.8458 0.9812 0.9712 0.9667 3.9735 4.0439 3.8929 3.8806 2.1791 3.9355 3.5372 3.9574 0.9786 3.9336 1.0139 3.9224 0.9704 0.9791 4.0084 0.9780 0.9688 0.9836 0.9590 0.9702 0.9622 0.9684 0.9669 0.9749 0.9690 0.9646 0.9685 4.1810 2.1395 1.9577 0.7448
dispcorr: -0.256047301 hartree
energy: -4231.738488990845
dipole: 194.09894 -194.26512 -0.16617 -152.42536 150.96041 -1.46495 -69.93685 70.12857 0.19172
magnitude: 1.48675 au
magnitude: 3.77903 debye
