program: Orca
programVersion: 4.2.1
elementType: Zn Mg O C C C H H N H C H H C H H N H C H H C C O C C H H N H C H H C H H N H C H H C C H C H C H C H O C O C H H H C C C C O C C C H C H C H H C H H H H H H H H H H H H I
elementType: I
charge: 0
multiplicity: 1
keywords: RKS BP86 D3BJ def2-TZVP def2/J SlowConv TightSCF NoFinalGrid Grid6
formula: C30H43IMgN4O5Zn
InChI: InChI=1S/C22H30N4O2.C6H10O.C2H3O2.I.Mg.Zn/c27-21-17-5-1-6-18(21)14-24-10-4-12-26-16-20-8-2-7-19(22(20)28)15-25-11-3-9-23-13-17;7-6-4-2-1-3-5-6;1-2(3)4;;;/h1-2,5-8,23-26H,3-4,9-16H2;4,6H,1-3,5H2;1H3;;;/q;2*-1;;2*+1
85 atoms
Zn -1.766301 0.001939 0.103311
Mg 1.052412 0.130118 -1.092415
O  -0.250426 -1.327402 -0.479203
C  -0.313516 -2.627542 -0.769396
C  -1.484906 -3.396071 -0.490936
C  -2.662843 -2.773493 0.20787
H  -3.489698 -3.517096 0.241105
H  -2.413634 -2.516587 1.261615
N  -3.132054 -1.525084 -0.444125
H  -2.997283 -1.606301 -1.467263
C  -4.562381 -1.284166 -0.171857
H  -4.702113 -1.320178 0.929612
H  -5.167558 -2.117696 -0.597891
C  -4.572901 1.264063 0.085646
H  -5.19334 2.157988 -0.155991
H  -4.697109 1.074015 1.173082
N  -3.150124 1.576323 -0.149582
H  -3.027731 1.849263 -1.140713
C  -2.685597 2.686306 0.718988
H  -2.416779 2.24052 1.701998
H  -3.519187 3.399751 0.901483
C  -1.52887 3.436747 0.119622
C  -0.342899 2.74633 -0.281334
O  -0.232818 1.421464 -0.155562
C  0.734363 3.528241 -0.811107
C  2.04355 2.89611 -1.208352
H  2.567197 2.466429 -0.32575
H  2.707095 3.691299 -1.615482
N  1.892451 1.800056 -2.197236
H  1.148303 2.057797 -2.868246
C  3.146029 1.581996 -2.945662
H  3.962443 1.462524 -2.201008
H  3.392735 2.491461 -3.541853
C  3.189664 -0.980936 -3.117282
H  3.47386 -1.792644 -3.827165
H  3.995151 -0.933234 -2.35307
N  1.937628 -1.338952 -2.422713
H  1.208361 -1.511134 -3.135482
C  2.101371 -2.568508 -1.605405
H  2.568152 -2.259522 -0.643236
H  2.811027 -3.267344 -2.101431
C  0.804421 -3.296277 -1.362843
C  0.714248 -4.660435 -1.694087
H  1.5871 -5.146097 -2.160328
C  -1.535826 -4.758764 -0.837584
H  -2.458695 -5.321554 -0.621254
C  -1.628512 4.831811 -0.032638
H  -2.562658 5.328039 0.277716
C  0.595103 4.921739 -0.948452
H  1.438796 5.492598 -1.369624
O  -0.03946 -0.219606 3.525086
C  -1.260825 -0.058862 3.254698
O  -1.828199 -0.190611 2.108773
C  -2.188136 0.338297 4.399833
H  -2.484468 1.400958 4.271278
H  -1.691113 0.226546 5.381161
H  -3.116958 -0.265132 4.370286
C  -5.062195 0.054863 -0.706642
C  3.108662 0.354851 -3.855814
C  -0.447439 -5.40432 -1.440761
C  -0.575925 5.589242 -0.563504
O  2.3878 0.014811 0.458369
C  2.030344 0.623019 1.704675
C  1.33146 -0.658516 1.909262
C  3.226626 0.953224 2.605189
H  1.346359 1.486914 1.580974
C  2.056938 -1.849656 2.453958
H  0.404368 -0.820719 1.360367
C  3.687978 -0.228859 3.480156
H  2.975149 1.823743 3.24597
H  4.045411 1.283111 1.929896
C  3.537507 -1.575444 2.760153
H  1.519196 -2.123824 3.38777
H  1.921646 -2.711419 1.76647
H  4.737182 -0.073341 3.80739
H  3.072641 -0.258072 4.406562
H  3.946064 -2.399968 3.380406
H  4.114979 -1.561746 1.811864
H  -0.50375 -6.469187 -1.710752
H  -6.17079 0.045408 -0.664027
H  -4.795499 0.165275 -1.781488
H  3.977476 0.416514 -4.543307
H  2.202333 0.381976 -4.501112
H  -0.668099 6.679021 -0.680929
I  -1.372967 0.3436 -3.290708
elementType: Zn Mg O C H N I
totalener: -4042.79658524 hartree
nucrepener: 7611.75991625 hartree
twoeener: 9210.71009097 hartree
cpcmener: -0.02614202 hartree
kineticenergy: 3845.41787961 hartree
exchangeener: -346.206815317405 hartree
correlationener: -14.027664176057 hartree
xcener: -360.234479493462 hartree
chargesum: -0.0000000
charge: 0.520752 0.896725 -0.697537 0.289093 -0.041317 -0.081849 0.118968 0.148525 -0.185977 0.249818 -0.155019 0.140135 0.123274 -0.147331 0.122631 0.140848 -0.202247 0.253960 -0.080143 0.133876 0.119045 -0.032907 0.243400 -0.668596 -0.058988 -0.076449 0.174767 0.113729 -0.341455 0.257727 -0.159340 0.134709 0.124813 -0.153401 0.123815 0.133644 -0.345434 0.256856 -0.074077 0.177366 0.112154 -0.102157 -0.211272 0.121308 -0.213401 0.119277 -0.212055 0.118618 -0.213310 0.120622 -0.409900 0.319445 -0.416818 -0.400221 0.141395 0.134590 0.136789 -0.247083 -0.202444 -0.188711 -0.186172 -0.574459 0.225406 0.088702 -0.273106 0.129575 -0.268477 0.171339 -0.170375 0.106474 0.109259 -0.189352 0.142423 0.145701 0.106639 0.098329 0.108675 0.100075 0.127722 0.127003 0.149772 0.125660 0.136845 0.127468 -0.668362
charge: -0.087385 -0.286879 0.107288 -0.231865 -0.136972 -0.229431 0.144668 0.159263 0.091456 0.204654 -0.282666 0.150090 0.137204 -0.281677 0.137194 0.150328 0.092267 0.204093 -0.228861 0.158518 0.144777 -0.136944 -0.232844 0.114116 -0.130906 -0.230545 0.165739 0.143783 0.070902 0.203696 -0.283225 0.151369 0.135413 -0.283043 0.135111 0.151605 0.072063 0.206451 -0.229641 0.164800 0.143660 -0.132256 -0.132011 0.153038 -0.132266 0.152932 -0.132242 0.152933 -0.131158 0.153122 0.104384 -0.565595 0.093832 -0.287655 0.138455 0.129569 0.134398 -0.263926 -0.258896 -0.182867 -0.182639 0.018302 -0.350390 -0.020669 -0.240261 0.159295 -0.243466 0.173594 -0.262813 0.143487 0.145966 -0.260228 0.166569 0.153330 0.137542 0.142705 0.138814 0.140828 0.148734 0.157108 0.153308 0.155688 0.153954 0.148768 -0.318943
qa: 0.5208 0.8967 -0.6975 0.2891 -0.0413 -0.0818 0.1190 0.1485 -0.1860 0.2498 -0.1550 0.1401 0.1233 -0.1473 0.1226 0.1408 -0.2022 0.2540 -0.0801 0.1339 0.1190 -0.0329 0.2434 -0.6686 -0.0590 -0.0764 0.1748 0.1137 -0.3415 0.2577 -0.1593 0.1347 0.1248 -0.1534 0.1238 0.1336 -0.3454 0.2569 -0.0741 0.1774 0.1122 -0.1022 -0.2113 0.1213 -0.2134 0.1193 -0.2121 0.1186 -0.2133 0.1206 -0.4099 0.3194 -0.4168 -0.4002 0.1414 0.1346 0.1368 -0.2471 -0.2024 -0.1887 -0.1862 -0.5745 0.2254 0.0887 -0.2731 0.1296 -0.2685 0.1713 -0.1704 0.1065 0.1093 -0.1894 0.1424 0.1457 0.1066 0.0983 0.1087 0.1001 0.1277 0.1270 0.1498 0.1257 0.1368 0.1275 -0.6684
va: 2.6271 1.9565 1.6935 3.8719 3.8355 3.7835 0.9655 0.9841 3.1744 0.9358 3.9013 0.9502 0.9625 3.8920 0.9624 0.9503 3.1609 0.9306 3.7898 0.9947 0.9693 3.8085 3.9044 1.7485 3.8713 3.7240 0.9563 0.9692 3.0467 0.9292 3.9319 0.9601 0.9605 3.9219 0.9604 0.9613 3.0612 0.9307 3.7066 0.9640 0.9700 3.8797 3.9022 0.9726 3.8857 0.9737 3.8959 0.9738 3.8985 0.9731 2.1279 4.1814 2.0136 3.8381 0.9664 0.9834 0.9688 4.0519 3.9771 3.8867 3.8832 1.8812 3.7318 3.6635 3.9847 0.9528 4.0155 0.9699 3.9714 0.9710 0.9734 3.9714 0.9771 0.9517 0.9624 0.9727 0.9599 0.9796 0.9682 0.9686 0.9642 0.9675 0.9739 0.9683 0.6803
dispcorr: -0.241855635 hartree
energy: -4043.038440872634
dipole: 97.33461 -97.37810 -0.04349 -23.09288 22.94345 -0.14943 221.28917 -220.48184 0.80733
magnitude: 0.82219 au
magnitude: 2.08985 debye
