program: Orca
programVersion: 4.2.1
elementType: Zn Mg O C C C H H N H C H H C H H N H C H H C C O C C H H N H C H H C H H N H C H H C C H C H C H C H O C O C H H H C C C C O C C C H C H C H H C H H H H H H H H H H H H I
elementType: I
charge: 0
multiplicity: 1
keywords: RKS BP86 D3BJ def2-SVP def2/J SlowConv TightSCF Grid6 OptTS Freq
frequency: 0.00 0.00 0.00 0.00 0.00 0.00 -309.14 18.14 22.70 25.07 32.64 34.16 40.19 45.11 47.93 50.94 59.79 65.29 68.61 74.58 79.34 88.04 91.74 101.80 111.86 122.74 131.79 136.29 137.82 145.42 153.48 163.62 187.83 195.39 211.87 216.55 221.90 226.89 232.36 237.58 245.46 253.22 261.27 265.71 275.43 280.96 298.41 301.31 304.98 308.23 310.05 317.32 322.65 333.46 342.30 347.12 355.84 377.42 392.83 394.65 413.86 436.43 446.81 450.71 455.21 458.43 466.65 479.04 502.79 527.76 533.86 539.10 554.45 556.24 557.34 564.51 572.11 576.79 585.00 629.71 631.20 633.41 664.83 709.98 711.61 741.59 741.77 765.46 772.61 774.43 806.77 806.99 815.75 842.51 850.08 858.26 859.66 862.74 868.02 878.63 880.97 884.03 901.44 911.76 912.68 918.40 921.74 923.35 934.91 946.68 947.10 955.48 956.77 965.93 969.96 974.46 981.72 984.83 996.32 998.42 1001.26 1005.86 1017.60 1020.86 1023.17 1033.25 1043.71 1046.62 1054.88 1056.07 1058.37 1085.01 1088.33 1098.75 1101.86 1102.11 1102.85 1111.78 1121.95 1123.29 1130.71 1132.12 1132.66 1169.60 1171.29 1175.32 1210.85 1211.35 1212.47 1213.97 1220.82 1224.82 1232.58 1237.16 1242.58 1243.24 1255.67 1260.56 1261.05 1269.69 1274.53 1289.04 1291.54 1292.06 1304.13 1311.38 1312.76 1314.74 1316.50 1320.93 1322.10 1329.28 1333.24 1333.41 1350.62 1359.53 1361.57 1363.45 1366.57 1369.46 1370.01 1372.88 1373.98 1379.88 1380.89 1381.82 1382.13 1396.69 1398.14 1410.85 1411.71 1412.05 1414.27 1415.22 1416.85 1418.84 1419.59 1420.71 1422.52 1422.82 1425.46 1428.36 1429.15 1451.98 1462.84 1463.36 1464.18 1582.79 1583.28 1594.33 1605.11 1607.95 2920.21 2921.60 2926.34 2927.72 2930.45 2932.55 2935.15 2939.59 2953.26 2959.80 2961.57 2962.65 2965.31 2967.53 2970.79 2978.98 2981.17 2983.68 2988.92 2990.89 2994.36 2996.17 2998.09 3001.06 3006.48 3006.73 3018.46 3021.25 3024.34 3024.87 3053.00 3086.32 3086.54 3089.10 3089.33 3089.62 3122.20 3122.68 3227.17 3323.05 3326.07 3331.96 3340.04
frequency: 18.14 22.70 25.07 32.64 34.16 40.19 45.11 47.93 50.94 59.79 65.29 68.61 74.58 79.34 88.04 91.74 101.80 111.86 122.74 131.79 136.29 137.82 145.42 153.48 163.62 187.83 195.39 211.87 216.55 221.90 226.89 232.36 237.58 245.46 253.22 261.27 265.71 275.43 280.96 298.41 301.31 304.98 308.23 310.05 317.32 322.65 333.46 342.30 347.12 355.84 377.42 392.83 394.65 413.86 436.43 446.81 450.71 455.21 458.43 466.65 479.04 502.79 527.76 533.86 539.10 554.45 556.24 557.34 564.51 572.11 576.79 585.00 629.71 631.20 633.41 664.83 709.98 711.61 741.59 741.77 765.46 772.61 774.43 806.77 806.99 815.75 842.51 850.08 858.26 859.66 862.74 868.02 878.63 880.97 884.03 901.44 911.76 912.68 918.40 921.74 923.35 934.91 946.68 947.10 955.48 956.77 965.93 969.96 974.46 981.72 984.83 996.32 998.42 1001.26 1005.86 1017.60 1020.86 1023.17 1033.25 1043.71 1046.62 1054.88 1056.07 1058.37 1085.01 1088.33 1098.75 1101.86 1102.11 1102.85 1111.78 1121.95 1123.29 1130.71 1132.12 1132.66 1169.60 1171.29 1175.32 1210.85 1211.35 1212.47 1213.97 1220.82 1224.82 1232.58 1237.16 1242.58 1243.24 1255.67 1260.56 1261.05 1269.69 1274.53 1289.04 1291.54 1292.06 1304.13 1311.38 1312.76 1314.74 1316.50 1320.93 1322.10 1329.28 1333.24 1333.41 1350.62 1359.53 1361.57 1363.45 1366.57 1369.46 1370.01 1372.88 1373.98 1379.88 1380.89 1381.82 1382.13 1396.69 1398.14 1410.85 1411.71 1412.05 1414.27 1415.22 1416.85 1418.84 1419.59 1420.71 1422.52 1422.82 1425.46 1428.36 1429.15 1451.98 1462.84 1463.36 1464.18 1582.79 1583.28 1594.33 1605.11 1607.95 2920.21 2921.60 2926.34 2927.72 2930.45 2932.55 2935.15 2939.59 2953.26 2959.80 2961.57 2962.65 2965.31 2967.53 2970.79 2978.98 2981.17 2983.68 2988.92 2990.89 2994.36 2996.17 2998.09 3001.06 3006.48 3006.73 3018.46 3021.25 3024.34 3024.87 3053.00 3086.32 3086.54 3089.10 3089.33 3089.62 3122.20 3122.68 3227.17 3323.05 3326.07 3331.96 3340.04
formula: C30H43IMgN4O5Zn
InChI: InChI=1S/C22H30N4O2.C6H10O.C2H3O2.I.Mg.Zn/c27-21-17-5-1-6-18(21)14-24-10-4-12-26-16-20-8-2-7-19(22(20)28)15-25-11-3-9-23-13-17;7-6-4-2-1-3-5-6;1-2(3)4;;;/h1-2,5-8,23-26H,3-4,9-16H2;4,6H,1-3,5H2;1H3;;;/q;2*-1;;2*+1
85 atoms
Zn -1.766301 0.001939 0.103311
Mg 1.052412 0.130118 -1.092415
O  -0.250426 -1.327402 -0.479203
C  -0.313516 -2.627542 -0.769396
C  -1.484906 -3.396071 -0.490936
C  -2.662843 -2.773493 0.20787
H  -3.489698 -3.517096 0.241105
H  -2.413634 -2.516587 1.261615
N  -3.132054 -1.525084 -0.444125
H  -2.997283 -1.606301 -1.467263
C  -4.562381 -1.284166 -0.171857
H  -4.702113 -1.320178 0.929612
H  -5.167558 -2.117696 -0.597891
C  -4.572901 1.264063 0.085646
H  -5.19334 2.157988 -0.155991
H  -4.697109 1.074015 1.173082
N  -3.150124 1.576323 -0.149582
H  -3.027731 1.849263 -1.140713
C  -2.685597 2.686306 0.718988
H  -2.416779 2.24052 1.701998
H  -3.519187 3.399751 0.901483
C  -1.52887 3.436747 0.119622
C  -0.342899 2.74633 -0.281334
O  -0.232818 1.421464 -0.155562
C  0.734363 3.528241 -0.811107
C  2.04355 2.89611 -1.208352
H  2.567197 2.466429 -0.32575
H  2.707095 3.691299 -1.615482
N  1.892451 1.800056 -2.197236
H  1.148303 2.057797 -2.868246
C  3.146029 1.581996 -2.945662
H  3.962443 1.462524 -2.201008
H  3.392735 2.491461 -3.541853
C  3.189664 -0.980936 -3.117282
H  3.47386 -1.792644 -3.827165
H  3.995151 -0.933234 -2.35307
N  1.937628 -1.338952 -2.422713
H  1.208361 -1.511134 -3.135482
C  2.101371 -2.568508 -1.605405
H  2.568152 -2.259522 -0.643236
H  2.811027 -3.267344 -2.101431
C  0.804421 -3.296277 -1.362843
C  0.714248 -4.660435 -1.694087
H  1.5871 -5.146097 -2.160328
C  -1.535826 -4.758764 -0.837584
H  -2.458695 -5.321554 -0.621254
C  -1.628512 4.831811 -0.032638
H  -2.562658 5.328039 0.277716
C  0.595103 4.921739 -0.948452
H  1.438796 5.492598 -1.369624
O  -0.03946 -0.219606 3.525086
C  -1.260825 -0.058862 3.254698
O  -1.828199 -0.190611 2.108773
C  -2.188136 0.338297 4.399833
H  -2.484468 1.400958 4.271278
H  -1.691113 0.226546 5.381161
H  -3.116958 -0.265132 4.370286
C  -5.062195 0.054863 -0.706642
C  3.108662 0.354851 -3.855814
C  -0.447439 -5.40432 -1.440761
C  -0.575925 5.589242 -0.563504
O  2.3878 0.014811 0.458369
C  2.030344 0.623019 1.704675
C  1.33146 -0.658516 1.909262
C  3.226626 0.953224 2.605189
H  1.346359 1.486914 1.580974
C  2.056938 -1.849656 2.453958
H  0.404368 -0.820719 1.360367
C  3.687978 -0.228859 3.480156
H  2.975149 1.823743 3.24597
H  4.045411 1.283111 1.929896
C  3.537507 -1.575444 2.760153
H  1.519196 -2.123824 3.38777
H  1.921646 -2.711419 1.76647
H  4.737182 -0.073341 3.80739
H  3.072641 -0.258072 4.406562
H  3.946064 -2.399968 3.380406
H  4.114979 -1.561746 1.811864
H  -0.50375 -6.469187 -1.710752
H  -6.17079 0.045408 -0.664027
H  -4.795499 0.165275 -1.781488
H  3.977476 0.416514 -4.543307
H  2.202333 0.381976 -4.501112
H  -0.668099 6.679021 -0.680929
I  -1.372967 0.3436 -3.290708
totalener: -4040.56419679 hartree
nucrepener: 7596.89226566 hartree
twoeener: 9194.46085184 hartree
cpcmener: -0.02528938 hartree
kineticenergy: 3830.67851131 hartree
exchangeener: -345.537238258217 hartree
correlationener: -14.053817967189 hartree
xcener: -359.591056225405 hartree
temp: 393.15 k
press: 1.00 atm
thermalcorrenthalpy: 0.00124506 hartree
totalenthalpy: -4040.04099610 hartree
elementType: Zn Mg O C H N I
chargesum: 0.0000000
charge: 0.729512 0.256403 -0.481835 0.278820 -0.132904 0.179799 0.015897 0.058828 -0.326150 0.164980 0.065882 0.040743 0.038087 0.067682 0.037462 0.040448 -0.326481 0.164384 0.183718 0.054936 0.015767 -0.139260 0.283031 -0.479821 -0.139637 0.211381 0.076574 0.006867 -0.328062 0.193744 0.068931 0.041817 0.034501 0.069449 0.034033 0.043993 -0.334846 0.195167 0.212980 0.083238 0.006674 -0.140604 -0.073575 -0.001805 -0.064146 -0.002339 -0.063045 -0.002608 -0.068463 -0.001835 -0.280207 0.116867 -0.374851 -0.043583 0.062024 0.040305 0.052416 -0.018721 0.005167 -0.029629 -0.030227 -0.478939 0.157743 0.054335 0.097503 0.044757 0.033760 0.086345 -0.067645 0.017909 0.016023 -0.004237 0.043907 0.044417 0.019506 0.022839 0.021845 0.023233 0.004213 0.042712 0.044634 0.038446 0.046814 0.004062 -0.662062
charge: 0.676722 -0.710554 -0.171020 0.069240 -0.085640 0.028068 0.027635 0.034512 -0.039665 0.078045 0.020721 0.032422 0.026796 0.020895 0.026891 0.032210 -0.038331 0.077010 0.028348 0.033152 0.027713 -0.086155 0.069944 -0.171535 -0.073867 0.064144 0.057826 0.026850 0.019609 0.106578 0.044269 0.039056 0.024978 0.044287 0.024630 0.039759 0.020268 0.109366 0.063956 0.059129 0.026894 -0.073893 -0.037260 0.033709 -0.037521 0.033471 -0.037214 0.033423 -0.035962 0.033696 -0.189033 0.043326 -0.272009 -0.101237 0.049240 0.035269 0.042543 -0.057008 -0.045317 -0.077647 -0.077347 -0.196198 0.072079 0.187897 -0.050073 0.029341 -0.043791 0.041681 -0.046050 0.032835 0.032770 -0.044596 0.052677 0.042942 0.028414 0.027646 0.029596 0.025615 0.034396 0.048890 0.038356 0.047428 0.043114 0.034473 -0.437829
qa: 0.7295 0.2564 -0.4818 0.2788 -0.1329 0.1798 0.0159 0.0588 -0.3262 0.1650 0.0659 0.0407 0.0381 0.0677 0.0375 0.0404 -0.3265 0.1644 0.1837 0.0549 0.0158 -0.1393 0.2830 -0.4798 -0.1396 0.2114 0.0766 0.0069 -0.3281 0.1937 0.0689 0.0418 0.0345 0.0694 0.0340 0.0440 -0.3348 0.1952 0.2130 0.0832 0.0067 -0.1406 -0.0736 -0.0018 -0.0641 -0.0023 -0.0630 -0.0026 -0.0685 -0.0018 -0.2802 0.1169 -0.3749 -0.0436 0.0620 0.0403 0.0524 -0.0187 0.0052 -0.0296 -0.0302 -0.4789 0.1577 0.0543 0.0975 0.0448 0.0338 0.0863 -0.0676 0.0179 0.0160 -0.0042 0.0439 0.0444 0.0195 0.0228 0.0218 0.0232 0.0042 0.0427 0.0446 0.0384 0.0468 0.0041 -0.6621
va: 2.3624 3.1115 2.1297 3.9080 3.9490 3.8486 1.0011 1.0165 3.3102 0.9966 4.0314 0.9929 0.9792 4.0281 0.9793 0.9954 3.3146 0.9988 3.8498 1.0200 1.0007 3.9537 3.9054 2.1320 3.9698 3.8542 0.9965 0.9958 3.2515 0.9572 4.0382 0.9872 0.9787 4.0366 0.9785 0.9854 3.2546 0.9534 3.8414 1.0015 0.9963 3.9735 3.8162 0.9884 3.8326 0.9888 3.8288 0.9887 3.8167 0.9883 2.2594 4.3517 2.1653 3.8995 0.9977 1.0072 0.9978 4.0819 4.0584 3.7521 3.7532 2.0939 4.0731 3.9577 3.9916 0.9824 4.0706 1.0432 4.1785 0.9800 0.9932 4.1270 1.0094 0.9815 0.9737 0.9816 0.9754 0.9935 0.9795 0.9831 1.0041 0.9825 0.9976 0.9795 0.6764
dispcorr: -0.241855635 hartree
energy: -4040.806550839756
dipole: 97.33461 -97.46150 -0.12689 -23.09288 22.98499 -0.10788 221.28917 -220.54039 0.74878
magnitude: 0.76708 au
magnitude: 1.94976 debye
zeropoint: 0.69132964 hartree
thermalvibcorrection: 0.06774744 hartree
thermalrotcorrection: 0.00186754 hartree
thermaltrasncorrection: 0.00186754 hartree
thermaltotal: -4040.04373869 hartree
thermalcorr: 0.07148252 hartree
nonthermalcorr: 0.69132964 hartree
totalcorr: 0.76281215 hartree
totalenthalpy: -4040.04249362 hartree
