program: Orca
programVersion: 4.2.1
elementType: Zn Mg O C C C H H N H C H H C H H N H C H H C C O C C H H N H C H H C H H N H C H H C C H C H C H C H O C O C H H H C C C C O C C C H C H C H H C H H H H H H H H H H H H C O O O C H C C H H H H H H H H C C C H I H O O C C H H H
elementType: I
charge: 0
multiplicity: 1
keywords: RKS BP86 D3BJ def2-TZVP def2/J SlowConv TightSCF NoFinalGrid Grid6
formula: C39H57IMgN4O10Zn
InChI: InChI=1S/C22H30N4O2.C15H23O6.C2H4O2.HI.Mg.Zn/c27-21-17-5-1-6-18(21)14-24-10-4-12-26-16-20-8-2-7-19(22(20)28)15-25-11-3-9-23-13-17;1-10(16)19-13-8-4-5-9-14(13)21-15(18)20-12-7-3-2-6-11(12)17;1-2(3)4;;;/h1-2,5-8,23-26H,3-4,9-16H2;11-14H,2-9H2,1H3;3H,1H3;1H;;/q3*-1;;+3;+1/p-1
113 atoms
Zn 1.96789 -0.310104 -1.34087
Mg 1.534304 0.360938 1.691236
O  2.036233 1.575415 0.049873
C  3.067036 2.468784 0.071765
C  3.325569 3.265825 1.225496
C  2.506295 3.134886 2.481774
H  2.876565 3.878597 3.222265
H  1.4402 3.38527 2.299513
N  2.553806 1.771211 3.058287
H  3.532884 1.440425 3.020235
C  2.131351 1.803605 4.474145
H  1.154688 2.331266 4.513932
H  2.849133 2.420946 5.063125
C  0.739362 -0.341051 4.661091
H  0.49241 -1.141645 5.396816
H  -0.130719 0.348233 4.635714
N  0.874622 -0.928766 3.314581
H  1.570299 -1.690492 3.364852
C  -0.410996 -1.510124 2.845899
H  -1.031721 -0.674698 2.457707
H  -0.957948 -1.969229 3.699447
C  -0.19064 -2.553714 1.789018
C  0.370529 -2.199148 0.519859
O  0.774532 -0.941264 0.278563
C  0.487079 -3.239266 -0.454189
C  1.02499 -2.948872 -1.82461
H  0.388643 -2.217541 -2.370714
H  1.039748 -3.891577 -2.416461
N  2.382661 -2.362644 -1.748009
H  2.891908 -2.774806 -0.949429
C  3.145062 -2.592988 -2.984714
H  2.523907 -2.209183 -3.820328
H  3.284073 -3.688257 -3.146246
C  4.391867 -0.370519 -3.166644
H  5.385617 0.047141 -3.452438
H  3.686411 -0.147971 -3.993295
N  3.887108 0.347982 -1.979028
H  4.555343 0.232861 -1.197974
C  3.720162 1.789122 -2.287364
H  2.711236 1.897321 -2.739717
H  4.462466 2.104327 -3.05313
C  3.901846 2.640728 -1.066313
C  4.945013 3.585741 -1.042793
H  5.578247 3.689205 -1.938476
C  4.379611 4.200101 1.213397
H  4.559867 4.797925 2.121275
C  -0.517017 -3.890542 2.081671
H  -0.920577 -4.123371 3.080457
C  0.144246 -4.564468 -0.127684
H  0.273897 -5.340084 -0.899855
O  -5.085194 -0.183479 0.374933
C  -5.265208 0.532898 -0.767667
O  -5.38335 0.037563 -1.874628
C  -5.281582 2.010802 -0.467371
H  -5.854711 2.228652 0.454056
H  -5.697959 2.564678 -1.327233
H  -4.239752 2.348576 -0.296693
C  1.981881 0.424559 5.113117
C  4.494113 -1.881192 -2.981079
C  5.189625 4.378317 0.085368
C  -0.346265 -4.912074 1.138057
O  -2.897163 -1.734193 -0.957788
C  -3.576377 -2.131182 0.254901
C  -5.027199 -1.627832 0.274907
C  -3.544398 -3.658305 0.280653
H  -3.028725 -1.703876 1.120851
C  -5.779888 -2.184013 1.487732
H  -5.512311 -1.926526 -0.677704
C  -4.275247 -4.215219 1.506016
H  -2.488208 -3.984967 0.258128
H  -4.024245 -4.032224 -0.650322
C  -5.72614 -3.716491 1.5472
H  -5.321975 -1.754281 2.405905
H  -6.826704 -1.818855 1.450967
H  -4.239769 -5.324338 1.494398
H  -3.743412 -3.893711 2.42939
H  -6.242386 -4.074121 2.462367
H  -6.284811 -4.139955 0.68306
H  6.008108 5.113262 0.090902
H  1.913755 0.569657 6.211173
H  2.896399 -0.185337 4.93976
H  5.099178 -2.284059 -3.819644
H  5.0566 -2.12243 -2.050999
H  -0.604556 -5.95377 1.37853
C  -2.22904 -0.565702 -0.948587
O  -1.666476 -0.413155 -2.151735
O  -2.162191 0.212822 -0.009608
O  1.185746 0.021335 -3.059789
C  0.030009 0.632006 -3.512682
H  -0.486744 -0.029706 -4.261115
C  -1.004817 0.860941 -2.394826
C  0.312554 1.991291 -4.226428
H  -0.374233 2.122976 -5.092152
H  1.338222 1.926407 -4.643832
H  0.795754 3.016881 -2.38392
H  0.51098 4.124714 -3.739587
H  -1.363085 3.830813 -1.849067
H  -1.87525 3.96376 -3.551201
H  -2.825165 1.964645 -1.979425
H  -2.506858 1.675743 -3.703553
C  -2.022557 1.945583 -2.741019
C  -1.32191 3.322747 -2.832858
C  0.152519 3.181963 -3.275566
H  -0.467255 1.138772 -1.467267
I  4.125428 -1.077885 1.457806
H  0.733411 2.326528 0.091427
O  -0.188407 2.815734 0.227161
O  -0.222781 1.468742 2.026341
C  -0.770416 2.320397 1.296633
C  -2.132489 2.854852 1.619714
H  -2.847901 2.022452 1.46932
H  -2.17331 3.146923 2.686862
H  -2.406788 3.709734 0.977551
elementType: Zn Mg O C H N I
totalener: -4770.69835953 hartree
cpcmener: -0.02720268 hartree
kineticenergy: 4570.12164241 hartree
exchangeener: -439.375928923614 hartree
correlationener: -18.061380630204 hartree
xcener: -457.437309553818 hartree
chargesum: -0.0000000
charge: 0.655440 0.868622 -0.814101 0.308068 0.006821 -0.132990 0.118517 0.158196 -0.322330 0.268708 -0.158690 0.131140 0.126203 -0.144695 0.122693 0.126893 -0.350735 0.260958 -0.146710 0.188299 0.111689 -0.065400 0.334019 -0.716456 -0.027351 -0.085047 0.170957 0.106306 -0.203484 0.243601 -0.133753 0.139692 0.110751 -0.135022 0.115379 0.139453 -0.209192 0.241544 -0.056816 0.134960 0.111049 -0.029149 -0.218445 0.123842 -0.214716 0.124224 -0.221927 0.119796 -0.207145 0.117207 -0.217711 0.269494 -0.325575 -0.406481 0.154068 0.149481 0.148564 -0.194017 -0.256398 -0.165128 -0.212479 -0.224541 0.056485 0.081194 -0.175897 0.078271 -0.200131 0.094223 -0.232039 0.166824 0.108494 -0.184814 0.108684 0.119715 0.114344 0.105250 0.114019 0.102487 0.130838 0.125554 0.133417 0.122966 0.135365 0.118116 0.400534 -0.234237 -0.409305 -0.551195 0.044301 0.023158 0.227659 -0.149147 0.091965 0.117442 0.125428 0.097846 0.099257 0.103406 0.094854 0.105634 -0.217594 -0.169160 -0.272321 -0.046686 -0.617216 0.344804 -0.345816 -0.438215 0.432371 -0.489644 0.187438 0.156100 0.154823
charge: -0.057693 -0.373536 0.058560 -0.223200 -0.129099 -0.236636 0.144032 0.157970 0.068857 0.203304 -0.284140 0.149940 0.135519 -0.284392 0.134507 0.150836 0.073817 0.207735 -0.237926 0.162768 0.141607 -0.135364 -0.217544 0.108244 -0.133114 -0.232787 0.164349 0.141366 0.095378 0.198871 -0.285946 0.152304 0.132309 -0.283131 0.134010 0.152171 0.096911 0.194047 -0.231412 0.160488 0.144713 -0.132901 -0.122146 0.154981 -0.125033 0.154502 -0.135437 0.152227 -0.134781 0.153239 0.296637 -0.518415 0.095685 -0.277157 0.142370 0.141808 0.140340 -0.258364 -0.265429 -0.168884 -0.188873 0.314068 -0.272330 -0.267647 -0.236588 0.158425 -0.239226 0.157785 -0.264037 0.157498 0.148145 -0.263370 0.147138 0.146974 0.143333 0.142047 0.142047 0.144112 0.151007 0.155538 0.154433 0.155141 0.149452 0.148231 -0.645803 0.315967 0.097932 -0.063388 -0.391206 0.135829 -0.263097 -0.249210 0.138156 0.137846 0.138414 0.135769 0.135388 0.137018 0.141753 0.145984 -0.238776 -0.261536 -0.276156 0.161939 -0.191513 0.192364 0.160622 0.153148 -0.514375 -0.266619 0.152941 0.146966 0.138408
qa: 0.6554 0.8686 -0.8141 0.3081 0.0068 -0.1330 0.1185 0.1582 -0.3223 0.2687 -0.1587 0.1311 0.1262 -0.1447 0.1227 0.1269 -0.3507 0.2610 -0.1467 0.1883 0.1117 -0.0654 0.3340 -0.7165 -0.0274 -0.0850 0.1710 0.1063 -0.2035 0.2436 -0.1338 0.1397 0.1108 -0.1350 0.1154 0.1395 -0.2092 0.2415 -0.0568 0.1350 0.1110 -0.0291 -0.2184 0.1238 -0.2147 0.1242 -0.2219 0.1198 -0.2071 0.1172 -0.2177 0.2695 -0.3256 -0.4065 0.1541 0.1495 0.1486 -0.1940 -0.2564 -0.1651 -0.2125 -0.2245 0.0565 0.0812 -0.1759 0.0783 -0.2001 0.0942 -0.2320 0.1668 0.1085 -0.1848 0.1087 0.1197 0.1143 0.1052 0.1140 0.1025 0.1308 0.1256 0.1334 0.1230 0.1354 0.1181 0.4005 -0.2342 -0.4093 -0.5512 0.0443 0.0232 0.2277 -0.1491 0.0920 0.1174 0.1254 0.0978 0.0993 0.1034 0.0949 0.1056 -0.2176 -0.1692 -0.2723 -0.0467 -0.6172 0.3448 -0.3458 -0.4382 0.4324 -0.4896 0.1874 0.1561 0.1548
va: 2.5281 2.0286 1.6301 3.6877 3.8362 3.8174 0.9708 0.9642 3.0316 0.9131 3.9200 0.9654 0.9609 3.9047 0.9611 0.9724 3.0439 0.9262 3.7228 0.9717 0.9719 3.7873 3.7094 1.7491 3.8566 3.7076 1.0038 0.9685 3.0960 0.9313 3.8766 0.9601 0.9622 3.8674 0.9604 0.9662 3.0760 0.9342 3.7423 1.0287 0.9720 3.8687 3.9074 0.9736 3.8977 0.9723 3.8521 0.9742 3.8504 0.9758 2.1504 4.1823 2.1674 3.8247 0.9698 0.9795 0.9779 3.9820 4.0890 3.8754 3.8391 2.2042 3.9067 3.8345 3.8858 1.0138 3.9334 1.0218 3.9506 0.9556 0.9794 3.9566 0.9771 0.9716 0.9649 0.9726 0.9621 0.9701 0.9676 0.9668 0.9746 0.9687 0.9662 0.9728 4.3689 2.2064 2.0807 1.9730 4.1224 0.9688 3.5245 3.8330 0.9710 0.9712 0.9651 0.9662 0.9871 0.9599 0.9755 0.9784 4.0086 3.8944 4.0415 1.1411 0.7513 0.9634 2.1908 2.0134 3.9754 3.8540 0.9732 0.9665 0.9671
dispcorr: -0.322506451 hartree
energy: -4771.020865985876
dipole: -298.79255 298.10388 -0.68867 77.38829 -76.52008 0.86821 -95.57316 98.14789 2.57473
magnitude: 2.80309 au
magnitude: 7.12488 debye
