program: Gaussian 16
title: Title Card Required
version: ES64L-G16RevA.03
frameworkgroup: C1[X(C6H5F20Sb3Te)]
method: RPBE1PBE
basis: def2TZVP
operation: Freq
keyword: #P
keyword: Geom=AllCheck
keyword: Guess=TCheck
keyword: SCRF=Check
keyword: GenChk
keyword: RPBE1PBE/def2TZVP
keyword: Freq
converged: YES YES NO NO
title: Mulliken charges:
elementType: Sb Sb F Sb F F F F F F F F F F F F F F F C C C C C C H H H H H Te F F F F
charge: 1.884220 1.911998 -0.394537 1.899510 -0.445896 -0.379846 -0.393285 -0.376814 -0.450471 -0.402378 -0.414985 -0.397031 -0.445777 -0.412984 -0.400972 -0.404050 -0.419630 -0.405951 -0.446082 0.054523 -0.218361 0.363620 -0.232381 0.058283 -0.225033 0.199688 0.230095 0.234334 0.200638 0.180806 1.474208 -0.325496 -0.395048 -0.402214 -0.302702
chargesum: -0.00000
title: Mulliken charges with hydrogens summed into heavy atoms:
elementType: Sb Sb F Sb F F F F F F F F F F F F F F F C C C C C C Te F F F F
charge: 1.884220 1.911998 -0.394537 1.899510 -0.445896 -0.379846 -0.393285 -0.376814 -0.450471 -0.402378 -0.414985 -0.397031 -0.445777 -0.412984 -0.400972 -0.404050 -0.419630 -0.405951 -0.446082 0.254211 0.011734 0.363620 0.001953 0.258920 -0.044227 1.474208 -0.325496 -0.395048 -0.402214 -0.302702
polarizability: 2.39640054e+02 2.03461675e+01 2.90251508e+02 -8.33714178e+00 3.28261269e+01 2.98904034e+02
1716.lowfreq: -99.0504 -4.5698 -0.0006 -0.0006 -0.0006 6.7470 11.4179 12.5896 15.8354
frequency: -99.0348 11.1111 14.4583 20.7735 23.7601 29.7358 34.8631 35.1055 38.6253 42.4884 46.0526 50.5443 56.3010 57.7738 60.8297 70.1645 88.6549 99.7122 103.4321 111.3881 122.0321 127.3438 130.8466 135.7892 144.6542 147.7299 152.7369 169.4074 175.6381 189.6161 197.9090 201.0704 207.1621 212.2780 219.3842 224.6547 239.6286 248.3378 251.0710 255.4315 255.9785 257.9171 265.0884 270.3077 272.9032 283.0944 285.0160 285.9087 295.6361 298.3495 316.0829 322.3760 409.0085 414.8320 441.4090 467.2918 511.2907 534.3449 552.6228 559.2341 571.7436 580.4799 588.5149 614.3342 642.1386 645.6972 654.4506 671.2935 674.8652 680.4926 681.5785 682.2666 689.8960 692.0880 693.6221 695.6149 697.8174 707.8274 720.7042 867.1819 872.1856 953.8521 996.6658 1012.2933 1051.1031 1090.1067 1141.3575 1155.1528 1212.8096 1306.5865 1378.8143 1505.6992 1506.3604 1773.8315 3205.7585 3208.2715 3237.3354 3239.6079 3252.2731
redmass: 7.1504 10.5042 23.1258 9.8653 11.3949 17.5478 11.8606 13.9316 16.1642 14.1243 20.4387 12.9874 7.4194 10.2154 18.0116 12.7219 21.3851 10.6569 15.2322 20.7795 22.4902 5.2507 25.2423 23.2508 18.9963 19.2299 18.9290 19.3640 19.1710 21.7233 20.2071 23.2453 19.4763 19.5918 24.1809 19.1484 19.8500 21.5076 22.4818 22.9171 23.4586 23.0416 23.7131 24.3513 23.7833 20.3034 19.6279 20.3150 19.0771 20.5485 20.7556 20.8468 3.6978 2.6840 4.6221 18.9903 19.2397 1.5812 11.3177 2.7879 16.5714 21.3728 16.8833 8.5134 19.6871 19.6373 19.8355 20.5794 19.9365 21.6116 18.8798 17.9163 21.4241 17.7948 11.9281 18.9302 22.6546 1.3225 23.1142 4.6796 1.3448 1.3111 1.4151 2.0611 1.6737 2.9511 1.2333 1.1304 2.1775 1.3715 3.2781 3.2186 3.2130 8.7525 1.0894 1.0885 1.0947 1.0984 1.0985
irintensity: 73.3373 0.4879 0.7652 2.0000 1.9364 0.4272 0.6753 3.3296 0.4055 0.0345 2.8743 3.1601 2.2934 4.0619 3.6046 21.1691 5.9211 4.7935 2.8381 5.9485 0.0941 2.0438 2.0448 2.6155 0.5829 0.8826 2.0635 6.5366 2.8688 43.9175 82.6684 238.9157 9.9368 8.9804 278.4636 3.7151 23.2948 31.9823 64.6651 125.1332 75.8180 62.3806 54.7861 19.9983 44.7915 28.8853 6.3057 1.8497 0.6923 22.0339 30.7982 51.3433 9.0967 2.1020 21.7505 108.7750 246.6953 5.8047 129.3434 9.5090 238.4329 228.0917 5.7208 96.6815 109.5789 68.7782 40.9241 249.0558 130.3167 105.2192 460.3166 49.4645 90.4162 50.9723 6.4251 230.9806 220.4005 126.5814 200.3424 142.3908 11.1275 0.9919 4.5247 21.3904 3.8944 17.5189 42.1180 25.8643 53.4329 18.2620 264.0161 41.7757 22.9108 38.4058 41.7540 4.3335 77.7271 221.1757 88.8224
temp: 298.150 k
press: 1.00000 atm
elementType: 51 51 9 51 9 9 9 9 9 9 9 9 9 9 9 9 9 9 9 6 6 6 6 6 6 1 1 1 1 1 52 9 9 9 9
symmnumber: 1
zpe: 350505.0 jmol-1
zpe.correction: 0.133500 hartree
zpe.thermalcorrener: 0.173850 hartree
zpe.thermalcorrenthalpy: 0.174794 hartree
zpe.thermalcorrgfe: 0.051760 hartree
zpe.sumelectzpe: -3216.369543 hartree
zpe.sumelectthermal: -3216.329193 hartree
zpe.sumelectthermalent: -3216.328249 hartree
zpe.sumelectthermalfe: -3216.451283 hartree
dipole: 11.9402 7.3766 12.2066
dipole: 18.6007
quadrupole: -240.7704 -261.0091 -220.9004
quadrupole: 28.5405 32.1863 20.5627
quadrupole: 0.1229 -20.1158 19.9929 28.5405 32.1863 20.5627
hfenergy: -3216.5030433 hartree
pointgroup: C01 [X(C6H5F20Sb3Te1)]
dipole: 4.9669627 2.9920526 4.4644128 debye
polarizability: 239.8772647|22.577771|292.0278849|-5.9215079|32.2800886|296.8904463 unknown
InChI: InChI=1S/C6H5.F4Te.14FH.2F.3Sb/c1-2-4-6-5-3-1;1-5(2,3)4;;;;;;;;;;;;;;;;;;;/h1-5H;;14*1H;;;;;/q;;;;;;;;;;;;;;;;;;+4;2*+5/p-14
charge 0 multiplicity 1
35 atoms
Sb -0.23490504 2.64424305 -0.70291777
Sb -3.30255686 0.22759122 0.19548954
F  -4.53828211 1.56952737 0.52242323
Sb -0.67053145 -2.69813839 0.37296233
F  -1.76654399 -1.01497529 -0.18445397
F  -2.81128374 0.05502035 1.97458211
F  -4.46558553 -1.21523256 0.24838487
F  -3.39572828 0.39447829 -1.64643219
F  -1.8639718 1.6160775 0.11585561
F  -2.20161001 -3.21263927 1.30163105
F  -0.13199934 -1.66536894 1.83561351
F  -1.34063833 -3.42615433 -1.20295475
F  0.68868198 -1.86172089 -0.6475069
F  0.36697447 -4.1695636 0.8285967
F  -0.8439391 2.0251659 -2.35048346
F  -1.40298154 4.0931237 -0.79867618
F  1.25694673 3.53610134 -1.37039468
F  0.13324145 3.04356483 1.08324619
F  0.68230077 1.01238561 -0.4725305
C  2.48811221 1.26224364 3.4831431
C  2.16595981 0.43540106 2.37880567
C  2.71708319 1.01452755 1.32106516
C  3.37702192 2.09209781 0.91194371
C  3.64888453 2.84573022 2.08058332
C  3.20775719 2.43461606 3.32606899
H  2.12836008 0.9248937 4.44897995
H  1.57755461 -0.46921623 2.44953766
H  3.68047781 2.3937322 -0.08038608
H  4.21131276 3.76118419 1.9335231
H  3.41993053 3.04704833 4.19258971
Te 3.17039889 -0.87801749 -0.8037504
F  5.01567583 -0.8322467 -0.89802713
F  3.42659912 -2.5212588 0.12878945
F  3.24432255 0.54179291 -2.08972051
F  2.90320471 -1.94437036 -2.28027846
