program: Gaussian 09
title: 000033814
version: EM64L-G09RevD.01
frameworkgroup: C1[X(C10H19N5)]
method: RPBEPBE
basis: SDD
operation: Freq
keyword: #pfreq=noraman
keyword: PBEPBE/SDD
title: #p freq=noraman PBEPBE/SDD
converged: NO YES NO NO
title: Mulliken charges:
elementType: N N N N N C C C C C C C C C C H H H H H H H H H H H H H H H H H H H
charge: -0.343217 -0.334925 -0.107140 -0.119119 -0.113967 -0.412232 -0.315756 -0.339187 -0.688827 0.043608 0.051863 -0.302258 0.071552 -0.717289 -0.753876 0.201105 0.204301 0.221589 0.224842 0.197875 0.197732 0.325418 0.210314 0.218654 0.210690 0.228508 0.230050 0.326168 0.222633 0.221410 0.227784 0.235105 0.240337 0.236254
chargesum: 0.00000
title: Mulliken charges with hydrogens summed into heavy atoms:
elementType: N N N N N C C C C C C C C C C
charge: -0.017799 -0.008756 -0.107140 -0.119119 -0.113967 -0.006826 0.130674 0.056421 -0.049169 0.043608 0.051863 0.156300 0.071552 -0.045461 -0.042180
polarizability: 1.93169516e+02 1.41834753e+00 1.71111244e+02 -1.87914670e-01 -5.30587791e-01 9.22935455e+01
1716.lowfreq: -40.5140 -32.2300 -16.2496 -3.1949 -2.0266 -0.0006 -0.0005 0.0003 6.6698
frequency: -40.4835 -31.6044 -14.9759 42.3801 47.4651 89.2361 96.1006 113.1954 123.5340 186.5807 187.3841 201.3803 215.1911 232.7758 242.6622 265.6275 313.2794 331.3559 377.7064 457.3114 523.5355 530.6076 533.1773 548.6769 610.2518 652.5115 710.7460 715.1472 733.9781 791.2333 793.5805 800.8511 893.7322 896.5064 897.5433 935.4506 970.0260 981.9032 1029.0285 1049.2688 1051.1747 1075.3561 1083.9312 1130.3309 1143.4738 1145.1636 1154.4389 1171.1395 1205.9733 1220.1680 1257.4656 1264.2960 1273.0236 1290.0402 1292.7459 1326.4207 1345.1943 1357.9027 1364.7240 1386.9752 1390.5731 1397.0474 1418.0466 1454.5821 1456.8391 1468.4706 1473.5278 1475.8475 1477.2506 1478.8968 1484.8483 1490.2549 1495.2446 1499.7929 1505.0556 1530.1458 1586.7534 2961.9952 2971.1185 2974.8850 2978.6544 2983.7775 2984.5849 2995.8330 3001.8565 3018.0408 3024.4675 3042.1328 3071.7405 3076.1936 3079.1167 3084.2461 3092.8824 3130.5698 3564.2836 3565.5050
redmass: 1.0173 2.0411 2.1698 2.2515 3.5616 2.7028 2.1601 3.4540 2.8403 3.7035 4.9293 2.9814 1.2642 2.8740 3.6752 1.5083 3.3710 3.0645 3.2481 3.6857 1.1659 4.0210 1.1128 5.9619 3.4335 6.6950 4.7662 9.4150 1.0813 1.1651 1.1333 7.2822 4.9998 2.6918 2.1547 1.1652 3.0182 2.1122 3.3715 2.7946 1.6537 2.2685 2.3967 3.1661 3.6376 1.5298 1.6062 3.2118 3.9137 1.2901 1.1020 1.5522 1.1437 1.0774 1.8501 1.6262 1.7179 1.7374 1.6860 1.3026 1.2184 1.2394 2.6246 1.1463 1.0921 1.0752 1.0691 1.0424 1.0411 1.1356 1.0976 2.2871 1.1432 1.1163 2.4066 5.6334 7.1552 1.0586 1.0590 1.0368 1.0592 1.0490 1.0466 1.0393 1.0991 1.1028 1.1034 1.1047 1.1011 1.0992 1.1011 1.0933 1.0985 1.1013 1.0770 1.0771
irintensity: 0.2464 0.1478 0.1146 0.0791 0.1090 3.9187 0.0246 0.6113 7.3037 1.2802 2.3497 0.2842 0.1435 0.0207 0.8160 0.6606 0.7568 3.0642 5.2356 6.8089 134.4606 3.6049 27.6306 11.6300 21.7165 0.1224 3.8741 0.0171 8.7825 0.0129 8.9812 23.1643 4.3501 16.1728 1.3272 0.6320 0.8114 6.2041 0.9920 1.9350 9.7223 1.1158 0.1944 5.5602 8.6630 1.7512 0.7414 24.0385 7.9358 0.3297 0.1243 1.9134 0.5304 0.2042 3.6570 0.5964 17.8345 31.9397 58.8819 21.6917 5.8103 31.0012 144.1859 27.1607 41.3640 11.1166 4.0798 12.7843 13.3029 107.7932 48.8855 177.4114 195.3469 10.2054 60.2977 1161.5295 341.7784 4.9475 14.8568 37.8794 72.4789 36.6862 31.8258 11.4266 0.7119 0.7673 13.7309 53.7585 90.4261 48.5835 52.2091 17.0883 31.9986 12.3671 98.6874 18.9893
temp: 298.150 k
press: 1.00000 atm
elementType: 7 7 7 7 7 6 6 6 6 6 6 6 6 6 6 1 1 1 1 1 1 1 1 1 1 1 1 1 1 1 1 1 1 1
symmnumber: 1
zpe: 761697.8 jmol-1
zpe.correction: 0.290115 hartree
zpe.thermalcorrener: 0.305062 hartree
zpe.thermalcorrenthalpy: 0.306007 hartree
zpe.thermalcorrgfe: 0.247210 hartree
zpe.sumelectzpe: -665.078572 hartree
zpe.sumelectthermal: -665.063625 hartree
zpe.sumelectthermalent: -665.062681 hartree
zpe.sumelectthermalfe: -665.121478 hartree
dipole: -1.6217 2.4586 0.0720
dipole: 2.9462
quadrupole: -82.1519 -85.8768 -92.5299
quadrupole: 6.6736 0.0328 -0.2878
quadrupole: 4.7009 0.9760 -5.6770 6.6736 0.0328 -0.2878
hfenergy: -665.3686878 hartree
pointgroup: C01 [X(C10H19N5)]
dipole: 0.6697656 -0.9455901 0.028796 debye
polarizability: 193.0515733|2.1466035|171.2307036|0.0536752|0.4309637|92.2920287 unknown
InChI: InChI=1S/C10H19N5/c1-4-6-7-12-10-14-8(3)13-9(15-10)11-5-2/h11-12H,4-7H2,1-3H3
charge 0 multiplicity 1
34 atoms
N  1.352157 1.030236 0.012941
N  -2.559688 -1.574479 -0.016229
N  -0.553071 -0.347528 -0.00008
N  -0.725283 2.1013 -0.009609
N  -2.745102 0.755645 -0.024974
C  3.737794 0.366121 -0.020279
C  2.275029 -0.11411 0.030259
C  4.738615 -0.811552 0.005099
C  6.208555 -0.34401 -0.047965
C  -0.01103 0.913146 0.00069
C  -1.925992 -0.360781 -0.014129
C  -1.859396 -2.867684 -0.009741
C  -2.083654 1.952653 -0.018669
C  -2.872392 -4.023786 0.014007
C  -2.92362 3.204787 -0.007526
H  3.940094 1.035181 0.841549
H  3.90018 0.964937 -0.939866
H  2.099604 -0.720215 0.941481
H  2.055174 -0.776357 -0.829818
H  4.530874 -1.484403 -0.851169
H  4.571609 -1.411641 0.922216
H  1.714117 1.985067 0.016568
H  6.448504 0.308782 0.812364
H  6.905413 -1.201395 -0.026122
H  6.408814 0.231204 -0.971447
H  -1.207398 -2.93848 -0.901939
H  -1.188657 -2.916746 0.869364
H  -3.5802 -1.540875 -0.028906
H  -3.507637 -3.981542 0.917967
H  -3.528589 -4.000516 -0.875749
H  -2.343528 -4.992406 0.017605
H  -3.309277 3.390491 1.012573
H  -2.319279 4.071525 -0.314858
H  -3.79634 3.08603 -0.670406
