program: Gaussian 16
title: CP TSS
version: ES64L-G16RevA.03
method: RPW6B95
basis: def2SVP
operation: Freq
keyword: #N
keyword: Geom=AllCheck
keyword: Guess=TCheck
keyword: SCRF=Check
keyword: GenChk
keyword: RPW6B95/def2SVP
keyword: Freq
converged: YES YES NO YES
title: Mulliken charges:
elementType: C C H C H C C H C H C H C H Rh Rh O O O O O O O C C C C C O C C C H H H H H H H H H H H H C H H H C C C C H C H C H H H
charge: -0.218072 -0.017019 0.053363 0.033386 0.030938 -0.301894 0.040004 0.008784 0.115063 0.006740 0.086189 0.004317 0.107150 -0.004393 0.091198 0.573260 -0.351574 -0.365586 -0.365164 -0.364325 -0.337282 -0.335927 -0.336330 0.285095 0.287352 0.281914 0.287112 0.039252 -0.337161 0.036934 0.037884 0.033081 0.044292 0.041772 0.041130 0.040321 0.041234 0.040198 0.030344 0.046737 0.044016 0.044012 0.042493 0.036856 0.167263 0.001440 0.079650 0.009429 0.133593 0.036470 0.031039 0.003632 0.003834 0.001844 -0.044713 0.023726 -0.016631 -0.016870 -0.011401
chargesum: -0.00000
title: Mulliken charges with hydrogens summed into heavy atoms:
elementType: C C C C C C C C Rh Rh O O O O O O O C C C C C O C C C C C C C C C C
charge: -0.218072 0.036345 0.064324 -0.301894 0.048789 0.121803 0.090505 0.102757 0.091198 0.573260 -0.351574 -0.365586 -0.365164 -0.364325 -0.337282 -0.335927 -0.336330 0.285095 0.287352 0.281914 0.287112 0.166446 -0.337161 0.158688 0.158981 0.156442 0.257783 0.133593 0.040304 -0.013675 -0.012999 -0.015027 0.012325
1716.lowfreq: -258.8875 -10.0897 -4.6756 -0.0002 0.0003 0.0009 4.1292 22.3147 27.3659
frequency: -258.8871 21.1521 27.3542 32.2987 39.8749 40.4027 44.7510 49.7256 61.5423 64.3817 67.9003 82.7084 86.0654 94.7549 108.9155 119.9248 127.9794 139.5211 142.7646 148.0863 168.7662 179.2485 193.6243 203.2048 216.3405 225.5468 237.4716 242.6937 243.8369 246.1983 258.6672 265.5976 291.0646 291.2735 295.3847 298.5721 302.3489 318.0138 321.6668 325.6324 336.2580 344.6733 375.3962 382.1519 384.4356 414.8492 424.8747 434.7778 493.1822 509.0908 575.4614 577.9593 588.8446 592.9994 595.3806 612.2155 615.9803 625.8012 627.8255 628.2638 628.9032 666.0762 692.6236 712.8903 713.5138 719.4443 731.3101 733.2463 738.4093 747.7194 777.0246 824.4482 858.6456 864.9695 894.1869 918.9511 948.5655 957.0873 965.6572 967.6806 975.7925 977.7009 978.2136 984.8835 987.5194 991.6113 1008.0028 1015.4733 1020.1329 1028.1536 1028.5959 1029.7138 1030.8066 1034.1309 1051.3208 1053.4005 1053.7374 1055.2099 1055.5743 1068.9197 1101.1963 1117.4698 1139.3430 1169.8439 1172.5300 1186.5230 1192.2043 1204.5779 1211.1585 1272.6332 1328.5723 1335.5695 1359.0285 1360.3300 1360.8159 1362.5535 1380.9913 1388.8731 1409.2345 1437.6842 1438.0585 1438.2451 1439.2574 1452.3474 1452.8665 1453.3567 1456.9469 1461.1352 1482.2738 1484.6052 1485.6077 1503.9680 1504.1999 1505.5249 1517.1806 1532.3426 1539.6582 1635.8388 1639.5699 1652.4858 1654.6288 1660.8213 1683.0738 1699.7783 1726.6635 3078.1435 3088.9836 3089.4357 3089.5736 3090.1116 3170.2656 3178.5533 3179.0226 3180.0711 3181.1240 3196.2670 3201.1267 3206.3303 3211.3364 3218.6836 3219.8638 3220.2143 3220.6803 3221.4500 3223.9025 3231.4150 3233.6421 3235.3898 3253.5678 3263.7790 3284.0471
redmass: 6.0065 4.0903 1.1425 1.1096 2.1309 1.3759 1.8422 5.3222 2.8763 3.2236 3.0542 2.9000 5.5008 3.3300 4.8453 5.3330 4.0114 4.7209 6.5941 6.1489 6.8767 5.7875 5.3396 11.0532 6.4196 4.9175 6.3941 6.6295 6.0794 6.5695 2.4277 4.2986 3.7999 4.6187 5.4452 4.8588 17.9451 1.9033 3.0613 3.6118 7.3510 3.7130 5.9685 7.3327 6.9807 2.7488 2.9380 2.7740 3.7679 3.7398 4.4587 4.4791 4.6602 4.7023 4.0610 2.6227 4.5997 2.6952 4.5063 3.1665 2.7650 4.0014 3.4975 6.9683 4.7172 1.7536 3.7922 1.7281 6.1351 1.6417 2.4250 2.2439 1.3558 1.9369 3.8603 5.0529 1.5439 1.5369 1.4802 1.7053 1.7084 5.2353 5.0275 1.8503 4.9296 5.4728 1.4560 4.3477 1.3810 1.5307 1.5675 1.5538 1.5452 1.3426 1.8479 1.8527 1.8513 1.8516 1.6911 2.0381 1.3234 1.4822 1.1940 3.1718 1.0695 2.1728 1.1626 1.1594 1.9904 4.3248 1.4535 1.4520 1.3209 1.3209 1.3188 1.3097 1.7144 4.4087 1.2280 1.0636 1.0632 1.0673 1.0590 1.0925 1.0720 1.0614 1.0665 2.1620 1.0699 1.4110 1.6209 6.7872 6.7448 7.5405 8.1318 2.4055 6.4405 9.1529 9.0511 5.9372 6.0697 9.3490 6.2067 7.1441 10.1147 1.0386 1.0378 1.0372 1.0370 1.0376 1.1031 1.1014 1.1018 1.1004 1.1006 1.1031 1.0872 1.0900 1.0862 1.1077 1.1069 1.1071 1.0921 1.1078 1.0911 1.0977 1.0892 1.0986 1.1046 1.0942 1.0912
irintensity: 66.2133 0.1048 0.7487 0.6271 0.3842 0.4083 0.6871 0.2814 0.2620 0.2100 0.8442 0.9667 1.5987 0.2955 0.6306 1.3618 0.1733 0.0493 1.0022 0.2267 0.7283 2.6946 4.5050 0.0804 0.0362 0.7584 1.1467 0.2172 1.4272 0.2181 0.4678 3.1318 1.0342 1.5186 0.2325 1.8934 5.3237 0.8480 0.1408 6.4978 12.4238 3.3245 26.4232 20.3104 41.7467 3.5950 2.7247 2.5018 3.0417 5.2663 0.2466 0.0038 0.1702 1.2374 39.6547 0.0610 9.7593 1.6962 1.3250 8.4592 9.2238 2.7976 4.2386 82.6560 103.2215 45.5198 8.1774 23.1188 4.2087 41.0659 1.9797 13.6368 10.8000 10.6942 0.4279 11.4646 0.1753 3.5986 0.7102 3.3186 4.4802 2.2711 0.2104 0.2616 0.1202 1.5621 1.0505 0.3090 0.8680 1.3435 1.3689 2.4678 2.7429 0.2362 1.2559 8.5482 16.1402 1.1683 9.0568 2.6959 6.0899 2.6962 0.0499 1.8349 0.1834 1.1282 4.3299 3.4844 3.5155 34.7660 1.1989 2.3053 2.8636 4.6408 1.8723 13.6287 8.1378 1.7393 1.7708 2.3623 1.4541 3.4272 52.6290 12.5314 31.8713 10.4318 13.4666 2.3577 28.0718 9.8119 2.8304 517.0586 94.1001 602.4033 125.5224 4.7172 16.2134 4.7575 4.5255 1.0798 5.8346 0.7243 1.0987 1.2539 664.4028 22.5608 2.7756 4.3460 2.1151 2.1416 15.9649 2.5215 2.5606 3.5881 2.2954 1.9796 1.7195 4.4451 0.7233 2.4407 2.6145 3.1111 11.3885 2.3526 0.9407 5.2193 2.8216 21.2233 5.2519 0.7537 1.4248
temp: 298.150 k
press: 1.00000 atm
elementType: 6 6 1 6 1 6 6 1 6 1 6 1 6 1 45 45 8 8 8 8 8 8 8 6 6 6 6 6 8 6 6 6 1 1 1 1 1 1 1 1 1 1 1 1 6 1 1 1 6 6 6 6 1 6 1 6 1 1 1
symmnumber: 1
zpe: 1197548.5 jmol-1
zpe.correction: 0.456122 hartree
zpe.thermalcorrener: 0.490716 hartree
zpe.thermalcorrenthalpy: 0.491660 hartree
zpe.thermalcorrgfe: 0.388349 hartree
zpe.sumelectzpe: -1715.488690 hartree
zpe.sumelectthermal: -1715.454096 hartree
zpe.sumelectthermalent: -1715.453152 hartree
zpe.sumelectthermalfe: -1715.556462 hartree
dipole: -5.6975 -2.3694 -0.8167
dipole: 6.2244
quadrupole: -220.3536 -201.4485 -197.2317
quadrupole: -5.0699 -3.4469 -2.7538
quadrupole: -14.0090 4.8961 9.1129 -5.0699 -3.4469 -2.7538
hfenergy: -1715.9448117 hartree
pointgroup: C01 [X(C23H26O8Rh2)]
dipole: -2.4415487 -0.007237 -0.1889425 debye
polarizability: 382.5655715|-29.4064419|343.1361238|-12.0102074|5.2308484|302.6633919 unknown
InChI: InChI=1S/C15H14.4C2H3O2.2Rh/c1-15(11-7-2-3-8-12-15)13-14-9-5-4-6-10-14;4*1-2(3)4;;/h2-12H,1H3;4*1H3;;/q;4*-2;2*+4
charge 0 multiplicity 1
59 atoms
C  -2.10324509 0.39570993 0.05737853
C  -2.75975826 -0.43470999 -1.78016846
H  -2.11450554 -0.13616712 -2.6049108
C  -3.90226718 0.32809438 -1.55157818
H  -4.06105603 1.2020158 -2.18412308
C  -2.9234186 -0.68295695 0.81823292
C  -4.85179542 0.05154255 -0.52419658
H  -5.89605081 0.32654646 -0.66213291
C  -2.60325222 -1.7887647 -1.27215787
H  -2.34425539 -2.5872401 -1.9631551
C  -4.40910143 -0.4699305 0.64020035
H  -5.09184694 -0.76133628 1.43940629
C  -2.7449251 -1.96635233 0.0445194
H  -2.71880139 -2.92970527 0.5481351
Rh -0.02175809 0.09926386 -0.10354214
Rh 2.40422563 -0.18854543 0.02177512
O  0.14157204 1.15568803 1.64702326
O  0.37912999 1.7855196 -1.20097537
O  0.05978268 -0.97040612 -1.85217413
O  -0.14014441 -1.65009001 0.9656537
O  2.27952726 -1.26570283 -1.71423625
O  2.08475494 -1.89849823 1.09364273
O  2.36926645 0.91099573 1.74705337
C  1.27571493 1.33809223 2.18270479
C  1.57230537 2.13991872 -1.42987523
C  1.16910871 -1.41473363 -2.27336112
C  0.90898129 -2.26206291 1.32262657
C  1.28366476 2.11941727 3.46600759
O  2.60238753 1.53460771 -1.0538591
C  1.74824251 3.39450844 -2.23899293
C  1.1403536 -2.15833006 -3.57967308
C  0.70524516 -3.54861714 2.07371085
H  0.62380025 2.98762482 3.37824915
H  0.89056295 1.48463862 4.26941053
H  2.30022663 2.42730986 3.71905168
H  1.13190453 4.1945164 -1.81618134
H  2.79848065 3.69177605 -2.26180075
H  1.39724665 3.21411742 -3.26183363
H  0.22117243 -2.74440249 -3.66715896
H  1.15417065 -1.4287318 -4.39885307
H  2.02012632 -2.79916773 -3.67102956
H  0.28275426 -4.29658969 1.39230668
H  1.65422691 -3.9149261 2.47012165
H  -0.0148598 -3.39797695 2.8846545
C  -2.50693663 -0.78623152 2.29813349
H  -2.28918345 -1.82746695 2.55458752
H  -1.59893125 -0.20997569 2.49512417
H  -3.30374103 -0.42772548 2.95977028
C  -2.46422764 1.81007363 0.28125324
C  -2.21165082 2.7815673 -0.70233466
C  -3.02575768 2.2421528 1.49087376
C  -2.5150228 4.11463732 -0.48818418
H  -1.78612676 2.46777568 -1.64991783
C  -3.29611477 3.58846091 1.71876796
H  -3.24264781 1.52800824 2.2763316
C  -3.04810491 4.53078236 0.7317927
H  -2.32715785 4.84134197 -1.27685975
H  -3.71762315 3.89424911 2.67472031
H  -3.27217521 5.58180444 0.90437402
