program: Gaussian 16
title: 12 shift P free
version: ES64L-G16RevA.03
frameworkgroup: C1[X(C15H14)]
method: RPW6B95
basis: def2SVP
operation: Freq
keyword: #N
keyword: Geom=AllCheck
keyword: Guess=TCheck
keyword: SCRF=Check
keyword: GenChk
keyword: RPW6B95/def2SVP
keyword: Freq
converged: YES YES YES YES
title: Mulliken charges:
elementType: C C C C H C H C H C H H H C C H H H C C C C H C H C H H H
charge: 0.011672 0.005592 0.051427 0.002409 -0.001310 -0.006129 -0.002532 -0.031727 -0.001099 -0.017562 0.024552 -0.000842 -0.001794 -0.147005 0.080938 0.031210 0.023436 0.029923 -0.015092 -0.009002 -0.007311 0.013290 -0.004075 0.015565 -0.021507 0.012910 -0.011940 -0.012816 -0.011181
chargesum: -0.00000
title: Mulliken charges with hydrogens summed into heavy atoms:
elementType: C C C C C C C C C C C C C C C
charge: 0.010830 0.003798 0.051427 0.001099 -0.008660 -0.032826 0.006991 -0.147005 0.165508 -0.015092 -0.013077 -0.028818 0.001350 0.002748 0.001728
chargesum: 0.00000
1716.lowfreq: -5.7687 -2.3203 -0.0006 0.0001 0.0004 20.7627 43.3652 66.1185 84.6252
frequency: 43.3625 65.9572 84.6184 107.6362 142.6966 186.0721 235.4135 278.2407 304.5082 337.0286 347.4711 421.2601 425.4280 444.4200 493.6190 511.0196 563.2073 605.8603 619.1756 629.8020 676.1167 730.4455 758.3699 795.8324 804.0698 829.3591 859.6299 874.9154 890.9929 900.8506 953.9919 964.7449 1012.9550 1014.8416 1020.2414 1020.8454 1026.4196 1029.2531 1036.5572 1037.3175 1061.3810 1070.3375 1096.8293 1117.0223 1172.1295 1197.7615 1227.9300 1242.9008 1262.7491 1303.1178 1326.9347 1357.2237 1386.5508 1394.1313 1417.6665 1438.9957 1467.7631 1476.0395 1489.0923 1499.2519 1541.0316 1628.0455 1658.5863 1670.6270 1688.9369 1690.4787 1731.6881 3044.2235 3123.0843 3173.3162 3183.0067 3185.7565 3195.1528 3203.7628 3207.2640 3208.2501 3214.8704 3215.8170 3224.1251 3230.7296 3238.5001
redmass: 3.3501 3.9480 4.0233 3.5727 1.2079 3.5940 2.9733 4.3398 4.1882 3.1625 3.0911 3.3721 3.4186 5.9090 3.7737 2.7427 3.5338 2.4759 3.0866 4.9826 5.0793 1.5468 1.7824 2.1709 1.4433 2.2188 2.7713 1.2751 2.3728 4.6856 1.4093 2.6846 3.0454 1.6974 1.3401 1.4150 1.9970 1.5092 1.3248 1.3339 2.2592 1.8264 2.2075 1.5876 1.0713 1.1082 1.5908 1.1084 1.0643 1.8369 1.4820 1.7627 4.2709 1.3265 1.6857 1.4652 1.1023 1.1367 2.2517 2.2773 2.6201 8.2152 6.5026 7.6428 7.0132 7.1246 5.7220 1.0457 1.0946 1.1015 1.0837 1.0856 1.0869 1.0932 1.0937 1.0856 1.0886 1.0967 1.0933 1.0960 1.1005
irintensity: 0.0040 0.1626 0.3310 0.5975 0.2348 1.1186 0.4682 0.4730 0.9845 0.5420 0.2481 2.0816 2.4218 0.6018 4.7583 4.1881 4.6404 18.7319 0.1395 3.6148 8.8873 35.5899 23.0786 21.9188 7.5266 7.7049 5.4698 0.0757 6.3099 2.9786 1.7202 9.3033 1.1033 0.0652 0.6454 0.4857 2.4844 7.7431 2.0793 1.7730 5.9964 0.0975 0.6509 4.4904 0.1297 0.2455 1.0281 0.5009 1.1481 0.0514 0.6752 3.1757 3.8881 4.5563 4.0633 0.1759 2.3001 9.2026 7.5468 0.3400 20.6593 2.2052 6.9719 79.9945 11.3365 3.0319 5.5081 28.7526 12.5962 10.3950 3.5292 0.4269 0.8217 7.7060 25.3288 4.4765 0.2409 28.1692 11.4085 17.7207 12.7331
temp: 298.150 k
press: 1.00000 atm
elementType: 6 6 6 6 1 6 1 6 1 6 1 1 1 6 6 1 1 1 6 6 6 6 1 6 1 6 1 1 1
symmnumber: 1
zpe: 642081.3 jmol-1
zpe.correction: 0.244556 hartree
zpe.thermalcorrener: 0.257202 hartree
zpe.thermalcorrenthalpy: 0.258147 hartree
zpe.thermalcorrgfe: 0.205061 hartree
zpe.sumelectzpe: -580.075392 hartree
zpe.sumelectthermal: -580.062745 hartree
zpe.sumelectthermalent: -580.061801 hartree
zpe.sumelectthermalfe: -580.114887 hartree
dipole: 0.4041 0.1154 -0.0537
dipole: 0.4237
quadrupole: -80.4200 -80.5028 -92.2994
quadrupole: 0.2562 2.7003 -1.5414
quadrupole: 3.9874 3.9046 -7.8920 0.2562 2.7003 -1.5414
hfenergy: -580.3199478 hartree
pointgroup: C01 [X(C15H14)]
dipole: 0.0923485 0.1360002 -0.0276206 debye
polarizability: 129.7623713|29.311398|266.3693929|-40.2675996|8.9368828|130.0852267 unknown
InChI: InChI=1S/C15H14/c1-13(15-11-7-4-8-12-15)14-9-5-2-3-6-10-14/h2-12H,1H3
charge 0 multiplicity 1
29 atoms
C  -2.75064784 4.13703597 0.63859431
C  -2.07613797 4.51403561 -0.47230085
C  -2.10693972 1.33946561 -0.74051266
C  -1.25540062 3.6712761 -1.30462023
H  -0.54992735 4.20251677 -1.94530605
C  -2.79942381 2.81660909 1.21253939
H  -3.12509711 2.77600907 2.25281584
C  -1.24891374 2.32349838 -1.40834509
H  -0.51105417 1.907885 -2.09471559
C  -2.52060634 1.62677751 0.63241282
H  -2.62855202 0.74772804 1.26902204
H  -3.25997931 4.91878814 1.20296547
H  -2.08689882 5.57300349 -0.73088598
C  -2.34022082 0.12790815 -1.3284981
C  -1.75372747 -0.19910257 -2.67705896
H  -0.67294363 -0.40422503 -2.62587448
H  -2.23381794 -1.08009046 -3.11348144
H  -1.88420125 0.63123754 -3.38180747
C  -3.15794953 -0.92443114 -0.69193551
C  -4.3825686 -0.63927508 -0.07021891
C  -2.74866183 -2.26595879 -0.73832819
C  -5.15075792 -1.6465817 0.50033468
H  -4.74375281 0.38719926 -0.05953749
C  -3.51214712 -3.27244258 -0.16168815
H  -1.80701168 -2.51960678 -1.22277382
C  -4.71751937 -2.96788041 0.46294582
H  -6.10168267 -1.39772646 0.96850821
H  -3.16315288 -4.30297204 -0.20070822
H  -5.31944864 -3.75673166 0.9100476
