program: Gaussian 16
title: Inverted boat C7 Me
version: ES64L-G16RevA.03
method: RPW6B95
basis: def2SVP
operation: Freq
keyword: #N
keyword: Geom=AllCheck
keyword: Guess=TCheck
keyword: SCRF=Check
keyword: GenChk
keyword: RPW6B95/def2SVP
keyword: Freq
converged: YES YES NO NO
title: Mulliken charges:
elementType: C C C C H C H C H C H H H C Rh Rh O C O C H H H O C O C H H H O C O C H H H O C O C H H H C O C H H H C H H H
charge: -0.012429 -0.003925 -0.278975 -0.000127 -0.002065 0.005370 0.006244 0.083296 0.047995 0.053117 0.072444 0.000570 -0.000375 0.022582 0.102299 0.525988 -0.364136 0.280406 -0.330004 0.039966 0.044461 0.048698 0.045824 -0.352041 0.277917 -0.334333 0.044888 0.051059 0.042741 0.044789 -0.333528 0.267610 -0.338648 0.046152 0.045482 0.053763 0.043530 -0.329706 0.281704 -0.372944 0.034554 0.046381 0.046358 0.047243 0.057077 -0.200281 0.074505 0.034159 0.078332 0.037448 0.122488 0.023964 0.036854 0.035257
chargesum: -0.00000
title: Mulliken charges with hydrogens summed into heavy atoms:
elementType: C C C C C C C C Rh Rh O C O C O C O C O C O C O C O C C O C C
charge: -0.011858 -0.004300 -0.278975 -0.002192 0.011615 0.131291 0.125562 0.022582 0.102299 0.525988 -0.364136 0.280406 -0.330004 0.178949 -0.352041 0.277917 -0.334333 0.183477 -0.333528 0.267610 -0.338648 0.188926 -0.329706 0.281704 -0.372944 0.174536 0.057077 -0.200281 0.224445 0.218563
chargesum: 0.00000
1716.lowfreq: -11.3409 -7.4623 -0.0008 -0.0006 -0.0002 2.7434 18.8091 27.3341 33.6430
frequency: 18.7095 27.3198 33.3235 36.6752 38.5441 50.9742 56.5135 58.2407 62.7595 68.0115 68.9781 74.4668 95.0942 107.6809 119.7117 127.2416 129.3204 135.2654 140.3817 152.8518 157.7989 175.1789 183.6949 192.5496 205.2729 218.0750 235.6087 238.2786 244.7586 246.0062 247.4001 251.7938 270.7761 288.6055 289.9003 297.0517 300.4031 310.1530 314.9277 326.4738 329.8122 347.6313 361.3878 386.3368 388.4301 406.4137 450.5410 474.7821 527.7166 580.4933 581.3558 583.1251 593.7571 597.4180 611.7247 625.8291 627.8582 628.1229 641.7396 697.4586 706.4617 716.0108 725.5592 731.2005 738.5310 756.2201 767.1576 792.9481 840.0176 875.5852 887.6311 927.4399 961.4916 968.1178 979.9612 981.0255 986.1913 990.0034 994.1758 995.9274 1005.8729 1024.3067 1029.1714 1029.3155 1031.0568 1033.3915 1045.8022 1052.8318 1053.8071 1054.7608 1055.2147 1056.3874 1115.3257 1158.4981 1203.4427 1235.7225 1262.7195 1267.1074 1302.9789 1360.8186 1362.1077 1363.7145 1365.3164 1367.1642 1377.3727 1379.5015 1428.3411 1433.5652 1436.5861 1437.1634 1437.7702 1438.9562 1445.8817 1449.8918 1452.4633 1452.6849 1454.3995 1460.8325 1469.9906 1481.5775 1499.0357 1502.1704 1505.4949 1517.5093 1628.8278 1631.2807 1633.3163 1658.3690 1697.8146 1706.2581 1722.8579 1792.1611 3076.0968 3078.8609 3091.4345 3091.6478 3091.8965 3093.4148 3171.2449 3178.4506 3181.0473 3181.8718 3182.6324 3182.8248 3184.8071 3185.9646 3195.8780 3201.7724 3203.2662 3211.6597 3222.6996 3223.2086 3223.6984 3224.4801 3224.7416 3241.4105
redmass: 5.1393 1.1274 2.9303 1.1905 1.2933 5.3434 2.2272 2.0794 2.8740 3.3505 3.1928 2.0564 2.5195 1.5193 6.3322 3.7914 4.7462 6.5748 5.2039 4.5146 5.2950 7.0053 4.0619 4.6675 14.9839 6.4759 3.3147 5.6274 6.8540 6.1177 6.3230 5.5021 1.4039 5.0000 5.7362 5.7041 2.7540 5.5569 3.9021 6.1072 4.3835 6.7229 3.2088 8.4224 8.7076 2.8554 4.0549 2.9914 2.9995 3.9161 3.4867 4.5337 4.7571 4.8497 2.6238 2.6928 2.7620 2.7563 2.9066 7.7949 1.4850 6.1585 7.4846 7.2099 7.1571 2.7712 1.4307 4.0587 1.6932 3.4526 3.9913 2.4269 2.6105 2.2883 5.2165 5.1276 1.5144 5.0488 4.5337 1.7827 1.3850 1.3023 1.5667 1.5581 1.5467 1.5368 2.2158 1.8459 1.7458 1.8570 1.8545 1.8597 2.3412 2.4733 1.9673 1.1286 1.3410 1.4640 2.6103 1.3313 1.3200 1.3199 1.3600 1.4858 1.2374 1.2465 1.4033 1.0594 1.0618 1.0609 1.0602 1.0644 1.0789 1.0898 1.0861 1.0821 1.0490 1.0761 1.1441 1.6103 8.2152 7.2668 6.7837 8.1498 8.7095 9.0988 9.0496 9.4084 5.7980 6.6590 10.0474 11.6108 1.0354 1.0363 1.0372 1.0369 1.0375 1.0376 1.1050 1.1016 1.1022 1.0850 1.1009 1.1005 1.0873 1.1000 1.0885 1.1069 1.1011 1.0958 1.1082 1.1070 1.1076 1.1061 1.0972 1.0937
irintensity: 0.0937 0.9150 0.1028 0.9869 0.8402 0.2650 0.4041 0.4943 0.0192 0.8659 0.8296 0.4257 2.1412 0.0283 2.5618 0.2519 0.7328 1.9937 0.2424 0.4644 5.1875 3.2908 9.2531 10.7332 0.4251 0.2396 1.1288 0.1866 0.0994 0.4373 0.1966 2.8882 0.4912 0.4877 0.3503 1.6364 2.2826 0.5113 3.2349 0.2333 1.7591 10.0723 1.2444 50.0912 45.8348 2.9323 0.3734 6.6533 17.7641 4.4357 7.7049 0.0554 0.4447 3.7025 0.0772 0.1167 8.4701 10.2819 1.8807 72.7618 38.1610 116.4768 61.9542 2.9538 3.5521 19.7784 18.1454 22.3145 4.2195 7.2231 13.2421 40.4382 13.1934 7.7506 3.3730 0.8659 2.7179 0.2309 7.2125 26.8940 8.1018 0.1034 1.3912 2.7512 1.3206 2.1964 5.4526 0.2778 3.7814 16.6567 13.7320 1.4023 2.2470 21.3142 12.9924 0.3436 7.9465 44.6624 29.4675 6.3739 9.0669 5.8131 43.9968 41.2348 1.6002 1.8351 8.9801 10.3837 6.7320 5.9312 15.9905 48.0419 16.4701 25.9270 20.4327 20.8585 5.9961 10.7562 5.8474 4.3644 361.6041 556.4994 289.6147 107.8618 0.5448 8.7199 26.2683 3.1372 0.2997 1.3044 642.0903 119.7837 4.9959 18.6850 1.3571 1.3535 1.3955 0.9379 4.2038 4.6253 1.6723 5.7513 1.9278 1.9746 3.0075 1.7900 9.9852 2.8587 2.2556 23.4473 1.6202 1.7026 1.7258 4.7476 6.1273 12.1250
temp: 298.150 k
press: 1.00000 atm
elementType: 6 6 6 6 1 6 1 6 1 6 1 1 1 6 45 45 8 6 8 6 1 1 1 8 6 8 6 1 1 1 8 6 8 6 1 1 1 8 6 8 6 1 1 1 6 8 6 1 1 1 6 1 1 1
symmnumber: 1
zpe: 1081868.5 jmol-1
zpe.correction: 0.412062 hartree
zpe.thermalcorrener: 0.446670 hartree
zpe.thermalcorrenthalpy: 0.447615 hartree
zpe.thermalcorrgfe: 0.343444 hartree
zpe.sumelectzpe: -1637.056501 hartree
zpe.sumelectthermal: -1637.021892 hartree
zpe.sumelectthermalent: -1637.020948 hartree
zpe.sumelectthermalfe: -1637.125119 hartree
dipole: 2.9547 0.7908 -2.1183
dipole: 3.7206
quadrupole: -198.9092 -192.7841 -184.9641
quadrupole: -14.2156 1.6306 -3.5843
quadrupole: -6.6900 -0.5649 7.2550 -14.2156 1.6306 -3.5843
hfenergy: -1637.4685628 hartree
pointgroup: C01 [X(C19H24O9Rh2)]
dipole: 1.1690663 0.2377982 -0.8481968 debye
polarizability: 355.0256455|-0.3827822|281.3238288|4.6580631|2.9667639|263.9536307 unknown
InChI: InChI=1S/C11H12O.4C2H3O2.2Rh/c1-10(12)9-11(2)7-5-3-4-6-8-11;4*1-2(3)4;;/h3-8H,1-2H3;4*1H3;;/q;4*-2;2*+4
charge 0 multiplicity 1
54 atoms
C  5.52796315 -0.56920239 0.81110378
C  5.39378001 -1.29638111 -0.32958753
C  3.01088046 0.66320843 -0.49449417
C  4.16738535 -1.51473074 -1.04913036
H  4.11486338 -2.44214218 -1.62226212
C  4.46327138 0.10125745 1.50809723
H  4.59413325 0.2061166 2.58676379
C  3.06384868 -0.73938439 -1.05479686
H  2.15835774 -1.10681889 -1.53262582
C  3.2968672 0.55517089 1.00798743
H  2.52061534 0.89841072 1.69117834
H  6.4942076 -0.5986277 1.31562941
H  6.26300426 -1.86144037 -0.66808043
C  1.62956894 1.24471682 -0.51968679
Rh -0.06172321 0.2898037 -0.20912063
Rh -2.13969804 -0.87252845 0.3152225
O  -0.06345375 -0.75914539 -1.9702738
C  -1.00618778 -1.56846181 -2.23490626
O  -1.99236673 -1.80067488 -1.50224963
C  -0.89416897 -2.31198991 -3.53391116
H  -0.61208517 -1.62437118 -4.33680187
H  -0.09706768 -3.05984785 -3.44511139
H  -1.83483426 -2.81468599 -3.76683115
O  0.89287188 -1.24205931 0.72695255
C  0.23775898 -2.22345547 1.19298795
O  -1.00645741 -2.35671844 1.1494859
C  1.04667748 -3.28939047 1.87152412
H  1.32128715 -2.93474768 2.87238008
H  0.46343337 -4.20752098 1.96774716
H  1.97372899 -3.46494199 1.31826496
O  -2.16374425 0.11791226 2.10017199
C  -1.25307309 0.94002794 2.35209506
O  -0.26983927 1.20809637 1.59683184
C  -1.32548961 1.70856115 3.63820722
H  -0.32365076 1.8486033 4.05259669
H  -1.73805514 2.70230053 3.42562079
H  -1.97923293 1.19840393 4.34881048
O  -3.12666689 0.69570907 -0.55444394
C  -2.48143911 1.64303507 -1.05352549
O  -1.21488239 1.74381106 -1.07943069
C  -3.24625089 2.76660448 -1.69138587
H  -3.00255483 2.80872711 -2.75903148
H  -4.31999532 2.61859255 -1.56289357
H  -2.93808119 3.71879555 -1.24678787
C  1.53981817 2.72075031 -0.48551569
O  1.67568848 3.23704324 0.60358905
C  1.25251347 3.46444458 -1.74953739
H  1.89937646 3.1210394 -2.56561333
H  0.21390492 3.25887518 -2.03303188
H  1.39462139 4.53488984 -1.57258073
C  4.03370539 1.58103082 -1.19136586
H  3.79945662 1.67107145 -2.25876467
H  4.04058581 2.5757113 -0.73189704
H  5.03725795 1.1583694 -1.10284129
