program: Gaussian 16
title: 12shift Me P
version: ES64L-G16RevA.03
frameworkgroup: C1[X(C11H12O)]
method: RPW6B95
basis: def2SVP
operation: Freq
keyword: #NGeom=AllCheck
keyword: Guess=TCheck
keyword: SCRF=Check
keyword: GenChk
keyword: RPW6B95/def2SVP
keyword: Freq
title: 12 shift Me P
converged: YES YES YES YES
title: Mulliken charges:
elementType: C C C C H C H C H C H H H C C O C H H H C H H H
charge: 0.022502 0.007348 0.050728 0.011132 0.005174 -0.007056 0.007665 -0.033058 0.004725 0.030522 0.033797 0.005605 0.003028 -0.191129 0.011697 -0.248719 0.029370 0.043566 0.029849 0.030085 0.084338 0.031478 0.009091 0.028260
chargesum: -0.00000
title: Mulliken charges with hydrogens summed into heavy atoms:
elementType: C C C C C C C C C O C C
charge: 0.028107 0.010377 0.050728 0.016306 0.000609 -0.028332 0.064319 -0.191129 0.011697 -0.248719 0.132871 0.153167
1716.lowfreq: -5.3148 -0.0004 0.0002 0.0004 7.3515 9.7448 40.2487 55.1041 80.0871
frequency: 40.2379 55.0998 80.0753 156.8605 177.3046 231.8185 266.9208 302.1593 318.6061 349.2893 387.0013 427.1998 452.9091 459.1592 553.0930 592.0458 616.3260 627.2287 641.0694 767.0153 812.8370 833.3558 861.6267 899.2317 903.2843 974.8055 978.7243 1007.2388 1019.4736 1027.2432 1038.9836 1043.2672 1047.0314 1066.8600 1142.6120 1242.3449 1245.5857 1271.2096 1301.3801 1359.2213 1370.5867 1398.7710 1426.0398 1440.7054 1442.5118 1458.5275 1475.6378 1480.4867 1511.6247 1589.5422 1628.3496 1684.2115 1716.1198 1782.3451 3042.1359 3071.9036 3125.3321 3156.5349 3188.5728 3191.2044 3193.9645 3204.7461 3205.0165 3217.9910 3222.4539 3250.3010
redmass: 3.4960 5.3195 2.2595 1.3907 3.3877 1.3669 1.9659 3.9656 3.7230 3.2872 2.9769 3.4344 5.7989 3.4102 2.1007 3.8828 2.9698 2.5357 2.8935 1.8604 1.4046 2.3303 2.8851 4.5513 2.3283 2.6060 1.6237 1.5600 1.3290 1.3776 2.0823 1.3230 1.7855 1.8126 3.1055 1.5106 1.2023 1.1115 1.8032 1.4697 1.5660 1.3128 1.6068 1.5177 1.0618 1.1228 1.0967 1.0654 2.3581 5.7817 8.2728 7.9007 5.1478 11.1118 1.0506 1.0384 1.0929 1.1008 1.0856 1.0968 1.0875 1.0894 1.1047 1.0938 1.0940 1.0905
irintensity: 1.2792 5.8028 2.0147 0.0608 1.2450 1.5064 0.9017 1.3876 1.2092 2.7156 0.3946 0.3902 0.1792 2.2084 28.3489 12.7603 0.9319 2.9323 28.0296 31.5564 2.4723 11.2200 28.6981 2.2160 7.8401 5.9338 78.2976 3.9131 2.2105 0.9136 1.0763 0.2924 5.1453 5.0615 19.4658 54.5992 9.9549 51.6691 115.4139 3.7344 117.9072 4.2953 11.4009 26.0429 12.0345 25.4472 14.8925 12.0963 6.1461 349.6714 139.4014 2.7029 29.2384 114.0664 31.3125 3.5236 12.5446 6.8539 6.9363 8.3781 2.3823 8.2662 6.9655 15.7262 11.5989 9.3166
temp: 298.150 k
press: 1.00000 atm
elementType: 6 6 6 6 1 6 1 6 1 6 1 1 1 6 6 8 6 1 1 1 6 1 1 1
symmnumber: 1
zpe: 526676.0 jmol-1
zpe.correction: 0.200600 hartree
zpe.thermalcorrener: 0.212036 hartree
zpe.thermalcorrenthalpy: 0.212981 hartree
zpe.thermalcorrgfe: 0.162727 hartree
zpe.sumelectzpe: -501.636377 hartree
zpe.sumelectthermal: -501.624941 hartree
zpe.sumelectthermalent: -501.623996 hartree
zpe.sumelectthermalfe: -501.674250 hartree
dipole: 1.5400 2.5371 -0.2578
dipole: 2.9791
quadrupole: -62.0586 -70.2060 -73.2467
quadrupole: -5.5432 1.4421 0.5252
quadrupole: 6.4451 -1.7022 -4.7429 -5.5432 1.4421 0.5252
hfenergy: -501.8369771 hartree
pointgroup: C01 [X(C11H12O1)]
dipole: 0.1550223 -0.7689362 -0.8708876 debye
dipolederiv: -0.0110197 0.0407537 -0.0587157 0.147625 -0.2586252 0.1399911 0.3639013 -0.3417596 0.0727435 -0.1289391 0.1455804 -0.0392308 -0.1408511 -0.0365286 -0.0618598 -0.3938099 0.4165221 -0.2407683 0.4087164 -0.5479576 0.047148 -0.543598 0.7812954 -0.1308062 0.1816418 -0.3089613 -0.0656851 0.2942721 -0.3975468 0.1778076 -0.1624819 0.214692 0.0995379 0.313151 -0.1539631 0.1838629 0.0730752 0.0010495 -0.0184767 0.0377434 -0.0013875 -0.0844088 -0.0143191 -0.0832413 -0.021332 0.1492759 -0.3100003 0.1310262 -0.2893627 0.1937776 -0.0824811 -0.1286734 0.1694856 0.1704 0.0653701 0.0207898 -0.0105243 0.0356611 0.0747004 -0.007956 -0.0284339 -0.0035668 -0.0847328 -0.2422509 0.2782362 -0.0134032 0.2809615 -0.4330607 0.1082978 0.2062406 -0.1098821 0.0036985 0.0489896 -0.0327197 -0.0555689 0.0678302 0.0222266 -0.0223389 -0.083084 -0.0147795 -0.0030136 -0.1989441 0.2247951 -0.0975301 0.0433456 -0.1628695 0.0674516 -0.2502845 0.273856 -0.1001817 0.1175762 -0.0438579 0.0167484 0.0615923 0.0692759 -0.0151226 -0.0247181 0.0282798 0.0534525 -0.0448649 0.0722789 -0.0636071 0.0441985 0.0916452 0.0089586 -0.0673076 0.0012564 0.0187287 -0.0368774 0.096959 0.000728 0.0724461 0.0538983 -0.0558296 0.0271638 -0.0468413 0.0543419 -0.6917892 0.7226398 0.0799729 0.8329204 -1.2663539 -0.0059499 0.2484842 -0.2672067 0.0862015 0.8245579 -0.6893 0.2240838 -1.0185168 1.5170296 0.1410269 -0.3583851 0.8854179 0.7678962 -0.4785255 0.0818115 -0.1944 0.2934708 -0.7370886 -0.1421575 0.2162555 -0.6548811 -0.9061071 -0.1604364 0.202684 -0.0911216 0.2781403 -0.2618901 0.118642 -0.1395317 0.1523332 -0.0328322 0.0020571 -0.0025326 0.0483794 0.0126404 0.0059081 0.0582001 0.0336743 0.0785809 0.0079731 -0.029442 -0.0066968 -0.0542527 -0.0554786 -0.0058243 -0.0404319 -0.0611407 -0.0289063 0.0497751 0.0447933 0.0328035 -0.000248 0.0431143 0.0274696 -0.0310994 0.0607194 -0.0895648 -0.0133695 0.0255779 0.1276891 -0.006873 -0.0281112 0.1290438 -0.025683 0.041716 -0.0457042 0.0090974 -0.0634363 -0.0550157 -0.0690056 -0.1046426 0.0055183 -0.0504794 -0.1056807 0.0747805 -0.0347004 0.0496356 0.030355 -0.0452674 0.0585981 -0.0746801 0.0768739 -0.0399601 0.0463365 0.0610207 -0.0173716 0.0072019 0.0923308 0.0327548 0.0518279 -0.0623758 0.0023809 0.0224092 -0.0364696 unknown
polarizability: 138.2182498|-70.2963057|143.373308|22.3624031|3.6936585|123.5100013 unknown
InChI: InChI=1S/C11H12O/c1-9(10(2)12)11-7-5-3-4-6-8-11/h3-8H,1-2H3
charge 0 multiplicity 1
24 atoms
C  5.21357764 -0.82514172 0.71688045
C  5.15875175 -1.32066645 -0.54565235
C  2.71432932 0.76351037 -0.50274909
C  4.06787424 -1.18038583 -1.46136322
H  4.09197443 -1.86089712 -2.31371487
C  4.20038247 -0.06654494 1.38603646
H  4.32613898 0.00867741 2.46674198
C  3.02315169 -0.31401096 -1.43755575
H  2.31499576 -0.42847446 -2.25675292
C  3.13041026 0.60143742 0.8819492
H  2.52208646 1.13729353 1.60427086
H  6.08673171 -1.08428511 1.31604734
H  5.98738401 -1.9450801 -0.87876564
C  1.9244296 1.81044669 -0.9351077
C  1.47365643 2.88673291 -0.02856554
O  1.89903556 3.04247981 1.10394829
C  0.41991999 3.8513415 -0.53714069
H  0.85206878 4.54502717 -1.2705463
H  -0.41626782 3.33896943 -1.02703118
H  0.05710476 4.43098018 0.31496737
C  1.49963323 1.87402213 -2.37843817
H  0.66680587 1.18996966 -2.6075455
H  1.17392347 2.87597956 -2.66615269
H  2.3249104 1.6053089 -3.04863234
