program: Gaussian 16
title: P C7 Me
version: ES64L-G16RevA.03
method: RPW6B95
basis: def2SVP
operation: Freq
keyword: #N
keyword: Geom=AllCheck
keyword: Guess=TCheck
keyword: SCRF=Check
keyword: GenChk
keyword: RPW6B95/def2SVP
keyword: Freq
converged: YES YES NO NO
title: Mulliken charges:
elementType: C C H C H C C H C H C H C H C O C H H H Rh Rh O O O O O O O C C C C C O C C C H H H H H H H H H H H H C H H H
charge: -0.202427 0.019716 0.057934 0.049826 0.003545 -0.235670 0.088165 -0.006446 0.144236 0.060509 -0.003152 0.008913 0.011731 0.030055 0.101575 -0.216848 0.038454 0.070028 0.023645 0.026977 0.021393 0.580065 -0.359728 -0.356814 -0.347913 -0.345021 -0.343887 -0.339092 -0.344390 0.284116 0.283131 0.284850 0.277386 0.035612 -0.337265 0.042140 0.042227 0.042018 0.045921 0.053279 0.051620 0.043817 0.050586 0.047133 0.052281 0.040627 0.047177 0.049608 0.045153 0.043726 0.202572 0.027209 0.023603 -0.013903
chargesum: -0.00000
title: Mulliken charges with hydrogens summed into heavy atoms:
elementType: C C C C C C C C C O C Rh Rh O O O O O O O C C C C C O C C C C
charge: -0.202427 0.077650 0.053371 -0.235670 0.081718 0.204746 0.005761 0.041786 0.101575 -0.216848 0.159103 0.021393 0.580065 -0.359728 -0.356814 -0.347913 -0.345021 -0.343887 -0.339092 -0.344390 0.284116 0.283131 0.284850 0.277386 0.186432 -0.337265 0.183677 0.182312 0.180504 0.239481
1716.lowfreq: -11.4737 -7.4837 -0.0004 -0.0001 0.0006 6.1502 22.8266 30.9464 36.8403
frequency: 22.7775 30.9092 36.8345 39.2238 52.8990 59.5130 63.4871 67.0153 71.4136 77.9949 93.7583 96.0766 110.2215 117.9383 128.7480 131.9399 143.1137 156.8527 159.6221 175.9533 190.2632 197.1224 207.8518 219.0931 227.7972 236.8004 241.9773 245.5200 248.2394 251.1204 264.5551 292.0265 296.1075 299.2496 312.3554 317.5689 326.6740 329.8384 346.8725 353.2960 361.9842 380.1144 384.8086 395.5442 465.7460 514.4131 571.2809 578.9548 581.8394 594.0355 599.5053 601.9157 606.0818 614.4157 626.0386 627.8065 630.8280 631.6523 670.8832 715.5893 718.0438 736.6315 743.4905 746.7806 768.9521 779.5364 801.8949 843.8754 887.4163 890.5415 939.9145 950.7104 970.1463 980.2593 981.0778 981.9285 990.7181 993.3087 996.1027 1029.5207 1029.8763 1030.9152 1040.5708 1041.1382 1047.0641 1053.5069 1055.5141 1056.1230 1058.3805 1062.1218 1085.8070 1105.5428 1116.3544 1126.7700 1129.7268 1154.7642 1218.6212 1235.9007 1299.2536 1305.8693 1363.0035 1363.6079 1365.2026 1369.6452 1374.5501 1384.6863 1395.6137 1397.2351 1435.5634 1436.4535 1436.6048 1437.6168 1441.8554 1447.7601 1451.6501 1452.2109 1455.3604 1457.9405 1465.9571 1468.5559 1485.0426 1513.3889 1514.1402 1517.1580 1526.9166 1598.0357 1618.9157 1625.8149 1649.0071 1676.7350 1715.0278 1858.3997 3071.0222 3080.5373 3089.1862 3090.8254 3091.8414 3091.9217 3161.0649 3173.9646 3180.3980 3182.3524 3183.3846 3185.0534 3200.2380 3205.9054 3206.5313 3221.6082 3222.6368 3223.0783 3223.4876 3228.0542 3235.2448 3245.8482 3251.2816 3262.2453
redmass: 3.6315 1.2049 1.0598 1.0691 2.4576 4.6239 3.3079 4.0144 3.1858 5.2801 1.9488 3.5213 5.8692 4.0673 4.1836 4.5448 4.6601 11.3171 9.4959 3.4678 4.1320 2.5001 8.9228 4.2375 1.5079 2.0002 4.8034 5.3510 5.8264 5.0763 1.9703 6.0405 6.5756 4.4074 2.7557 15.3854 6.1047 5.8578 9.6077 4.1997 3.1178 5.0714 8.5883 6.3209 4.1118 3.4832 2.7011 4.5025 4.5108 4.7653 4.8754 2.9627 3.5880 2.6183 3.0348 2.6924 2.7504 2.7390 4.0054 7.5842 7.6680 7.2461 6.9140 2.8438 2.7230 3.8509 2.4403 1.3613 1.6216 1.9235 2.6188 1.5327 1.3060 2.0894 5.3420 2.7437 3.1937 2.3443 5.7735 1.5375 1.5355 1.5533 1.5492 1.4388 1.8424 1.8595 1.8648 1.8687 1.8610 1.5161 2.6567 1.4002 2.9312 2.0561 1.2921 1.4981 1.9770 2.4318 2.5372 1.5724 1.3172 1.3145 1.3079 1.2982 1.7116 1.7662 1.3523 2.0586 1.1029 1.0693 1.0835 1.0638 1.0620 1.0548 1.0888 1.0848 1.0639 1.0678 1.1187 1.2239 2.7125 7.0824 7.6231 6.2572 7.5729 5.9795 8.8233 8.8008 9.2065 6.6604 9.9358 11.7269 1.0376 1.0399 1.0372 1.0384 1.0372 1.0381 1.0986 1.0998 1.1004 1.1014 1.0994 1.0995 1.1026 1.1071 1.0907 1.1087 1.1074 1.1084 1.1082 1.0870 1.0906 1.0889 1.1066 1.1026
irintensity: 0.3386 0.6869 0.4997 0.4063 0.6860 0.2246 1.1475 0.7004 0.4077 0.7625 0.8710 0.8126 3.1881 2.2405 1.0528 1.0057 0.0588 0.2293 0.5803 0.0851 3.0864 1.9442 0.3832 0.2035 0.4890 0.7607 0.2622 0.1984 0.2707 0.3021 0.8348 0.1676 0.4140 0.1126 0.5376 3.3563 4.5516 9.5137 5.2828 3.9601 1.2331 25.0543 42.7586 28.4449 1.3706 1.9749 6.1841 0.1769 0.8976 0.4534 3.5972 2.9345 13.1731 0.5689 3.4567 0.4906 10.9874 8.7743 17.2516 110.6999 116.7692 1.0427 3.1703 16.0366 16.3523 7.8275 22.6247 48.1162 20.6646 3.0258 7.7992 0.2746 1.1527 11.0982 2.5086 7.4978 3.4285 3.3395 0.3696 0.3017 1.9486 2.9148 1.5583 0.1042 0.1827 4.6357 13.9814 8.6240 5.4554 2.8810 8.1987 1.2701 8.6423 11.2228 10.5990 2.2955 11.9368 15.3516 24.8008 6.9440 0.6728 5.7944 5.0642 0.2245 31.7624 30.0924 4.4235 5.0148 21.5852 1.4129 19.8667 70.2502 8.0875 4.7721 37.6381 12.1739 14.8709 12.8053 5.2675 5.8744 7.4870 333.9760 351.7929 565.9448 51.7571 27.9870 9.3919 6.4799 2.5356 1.8172 693.2460 164.2546 6.0617 22.0872 1.7330 0.9154 1.4718 1.0793 3.9394 8.9492 1.5826 1.7237 2.0979 2.2549 5.8700 4.2000 6.3235 0.3614 1.7073 1.3385 1.4456 2.3000 4.5619 0.1427 13.8361 0.1155
temp: 298.150 k
press: 1.00000 atm
elementType: 6 6 1 6 1 6 6 1 6 1 6 1 6 1 6 8 6 1 1 1 45 45 8 8 8 8 8 8 8 6 6 6 6 6 8 6 6 6 1 1 1 1 1 1 1 1 1 1 1 1 6 1 1 1
symmnumber: 1
zpe: 1090911.1 jmol-1
zpe.correction: 0.415506 hartree
zpe.thermalcorrener: 0.448471 hartree
zpe.thermalcorrenthalpy: 0.449415 hartree
zpe.thermalcorrgfe: 0.350410 hartree
zpe.sumelectzpe: -1637.134784 hartree
zpe.sumelectthermal: -1637.101819 hartree
zpe.sumelectthermalent: -1637.100875 hartree
zpe.sumelectthermalfe: -1637.199880 hartree
dipole: -0.8198 -1.2008 -2.6535
dipole: 3.0258
quadrupole: -209.7868 -180.7051 -191.1994
quadrupole: 1.4435 0.6463 -6.1773
quadrupole: -15.8897 13.1921 2.6977 1.4435 0.6463 -6.1773
hfenergy: -1637.5502902 hartree
pointgroup: C01 [X(C19H24O9Rh2)]
dipole: -0.3590936 -0.5589459 -0.9878084 debye
polarizability: 316.3723443|12.2755187|274.4299844|3.944354|-2.8853564|253.8205661 unknown
InChI: InChI=1S/C11H12O.4C2H3O2.2Rh/c1-7(12)11-5-3-8-9(4-6-11)10(8,11)2;4*1-2(3)4;;/h3-6,8-9H,1-2H3;4*1H3;;/q;4*-2;2*+4
charge 0 multiplicity 1
54 atoms
C  -3.25726711 0.09552679 -0.26345289
C  -2.1413498 -0.10441123 -1.27777962
H  -1.9133437 0.62634043 -2.0500433
C  -4.44719978 -0.11234354 -1.19967438
H  -4.80905974 0.66466553 -1.87019605
C  -3.22740158 -1.21457162 0.5827463
C  -4.81966748 -1.39835303 -1.20593254
H  -5.56825854 -1.82929583 -1.86704782
C  -1.77416573 -1.41841224 -1.31982166
H  -1.17888675 -1.86484835 -2.11199349
C  -4.04393847 -2.17001847 -0.23197556
H  -4.46434347 -3.06642741 0.22146216
C  -2.47564048 -2.17652577 -0.28495881
H  -2.01020093 -3.05803147 0.14834602
C  -3.33076016 1.43353037 0.45453438
O  -3.80573358 1.53358223 1.558615
C  -2.8582689 2.62926948 -0.32719846
H  -1.7891286 2.52241012 -0.5465213
H  -3.37962682 2.68858529 -1.29208343
H  -3.04591037 3.54044982 0.24648044
Rh 0.10849688 -0.19004579 -0.34185352
Rh 2.24361016 0.41469058 0.56519069
O  -0.72185613 0.89284106 1.17060367
O  0.24788849 1.49974143 -1.50474167
O  1.12029187 -1.2292681 -1.78925023
O  0.16715286 -1.81731125 0.89972829
O  3.10865251 -0.697366 -0.90614762
O  2.14485569 -1.22394971 1.76541961
O  1.26808415 1.49684914 1.99288029
C  0.0120983 1.49385776 2.00986229
C  1.2745606 2.23658134 -1.42694569
C  2.38359739 -1.26950383 -1.75835182
C  1.14697177 -1.98210005 1.68127648
C  -0.67971587 2.23348379 3.11487971
O  2.25443774 2.03463346 -0.66988402
C  1.29492562 3.46503606 -2.28794127
C  3.06791665 -2.09622785 -2.80680237
C  1.11107227 -3.19629738 2.56215145
H  -0.19478585 3.20152564 3.27207843
H  -1.74410884 2.35181188 2.89809698
H  -0.56510786 1.65638527 4.04061576
H  0.81716408 3.26292837 -3.2502548
H  0.72036089 4.25288832 -1.78502433
H  2.31978444 3.81619282 -2.42595172
H  3.23189468 -3.10287939 -2.40273205
H  2.44362918 -2.17936479 -3.69936865
H  4.04319101 -1.6661848 -3.04804451
H  1.27479591 -4.08734607 1.94457299
H  1.8888116 -3.13862847 3.32610118
H  0.12276678 -3.29101123 3.02242974
C  -3.16530188 -1.2559998 2.08041754
H  -2.29309432 -0.70517699 2.44513038
H  -4.05773466 -0.8134426 2.53173328
H  -3.07744047 -2.29945306 2.40840782
