program: Gaussian 09
title: 000033834
version: EM64L-G09RevD.01
frameworkgroup: C1[X(C8H12Cl3N5)]
method: RPBEPBE
basis: SDD
operation: Freq
keyword: #p
keyword: freq=noraman
keyword: PBEPBE/SDD
title: #p freq=noraman PBEPBE/SDD
converged: YES YES NO NO
title: Mulliken charges:
elementType: Cl Cl Cl N N N N N C C C C C C C C H H H H H H H H H H H H
charge: 0.099961 0.116133 0.082893 -0.341567 -0.073841 -0.118671 -0.067252 -0.343264 -0.029359 -0.670862 -0.714151 0.049914 0.313635 0.089920 -0.748843 -0.622495 0.251247 0.320553 0.212290 0.200016 0.255325 0.204071 0.233431 0.227831 0.326636 0.227524 0.292154 0.226772
chargesum: 0.00000
title: Mulliken charges with hydrogens summed into heavy atoms:
elementType: Cl Cl Cl N N N N N C C C C C C C C
charge: 0.099961 0.116133 0.082893 -0.021014 -0.073841 -0.118671 -0.067252 -0.016628 0.221887 -0.003231 -0.048819 0.049914 0.313635 0.089920 -0.748843 0.123955
polarizability: 1.98359397e+02 -2.75276892e+01 1.72228909e+02 -1.51148498e+00 1.91181760e-01 1.10186142e+02
1716.lowfreq: -9.2524 -3.5254 -0.0010 -0.0007 0.0015 7.7601 9.0366 32.7006 54.0812
frequency: 6.0401 32.5449 54.0744 75.7842 85.3181 105.3752 120.4728 126.5533 170.0589 177.6779 210.7355 214.7375 215.9793 221.5912 251.3147 251.7277 282.3081 291.7785 325.9736 374.1439 399.9641 411.4330 455.8217 517.0860 570.9464 606.6794 620.5928 625.8845 660.0122 714.8733 743.4263 750.3167 752.3245 810.6249 841.4036 893.7079 916.9309 924.8522 950.5564 987.1663 1032.0172 1094.7051 1125.6465 1136.7270 1140.4936 1167.3103 1181.6305 1253.9000 1277.9327 1310.4365 1349.0866 1370.4531 1377.5023 1394.1197 1405.7153 1431.9157 1453.0802 1462.8555 1469.3456 1478.0422 1484.2941 1487.2812 1489.8085 1494.8560 1560.0494 1604.9622 2977.3502 2979.2745 2983.0299 3033.9939 3055.6016 3071.7269 3083.3154 3095.8276 3098.9000 3123.1375 3547.4466 3563.6292
redmass: 13.7390 2.7129 3.4703 5.1007 7.4760 1.2596 3.7102 2.9692 7.2926 8.3959 5.3901 1.0989 5.5945 4.3745 1.7492 4.4744 2.7540 16.9128 4.8086 17.8927 3.6784 3.1595 2.8046 5.5326 1.1834 1.6649 2.8455 5.8537 6.7577 8.8560 7.4343 11.0699 9.9296 12.3041 2.6343 13.4991 1.8048 1.5689 1.5073 2.8744 3.5246 3.4832 1.2801 2.1125 2.1091 2.0654 2.4698 2.6776 7.4180 1.7024 1.3755 2.5672 1.2150 1.2493 1.5379 1.2768 2.3313 1.1404 1.0482 1.1386 1.3883 1.0610 1.0469 2.3001 4.9243 4.9112 1.0377 1.0359 1.0360 1.0856 1.1024 1.0983 1.0988 1.0994 1.1001 1.0978 1.0768 1.0766
irintensity: 0.0310 0.0660 2.5323 0.6029 1.2655 0.0643 1.9340 1.3765 0.4415 0.6122 0.9816 0.1205 0.4803 0.8471 0.5649 0.4998 0.1563 0.2384 0.8221 0.2999 0.3376 0.0100 0.7879 20.4131 67.5756 216.5560 5.2962 35.2804 38.8666 2.1012 69.0810 127.9946 97.2899 1.3602 1.8113 16.0321 4.3105 1.4991 0.7186 3.3755 29.9357 18.3968 0.0431 56.2661 17.7902 2.8201 104.7069 5.8718 0.5323 10.0139 28.4414 139.5260 27.6925 12.4273 102.7024 49.4685 25.9112 4.0608 4.5342 16.4563 86.3358 34.2431 13.6862 180.1930 1446.0198 163.8034 28.9972 99.8374 27.6566 0.3340 32.7982 13.3750 53.1761 25.5372 34.2917 0.7517 57.4757 65.2727
temp: 298.150 k
press: 1.00000 atm
elementType: 17 17 17 7 7 7 7 7 6 6 6 6 6 6 6 6 1 1 1 1 1 1 1 1 1 1 1 1
symmnumber: 1
zpe: 540689.3 jmol-1
zpe.correction: 0.205938 hartree
zpe.thermalcorrener: 0.223870 hartree
zpe.thermalcorrenthalpy: 0.224814 hartree
zpe.thermalcorrgfe: 0.156896 hartree
zpe.sumelectzpe: -1964.777348 hartree
zpe.sumelectthermal: -1964.759416 hartree
zpe.sumelectthermalent: -1964.758472 hartree
zpe.sumelectthermalfe: -1964.826390 hartree
dipole: 3.4258 3.9652 -0.0216
dipole: 5.2402
quadrupole: -102.9260 -102.7294 -116.6512
quadrupole: -7.8632 -0.5694 0.7615
quadrupole: 4.5096 4.7061 -9.2157 -7.8632 -0.5694 0.7615
hfenergy: -1964.9832858 hartree
pointgroup: C01 [X(C8H12Cl3N5)]
dipole: 0.9358321 1.8347894 0.0904234 debye
polarizability: 209.6649934|-18.315191|160.895488|-0.2783927|1.6567343|110.2139666 unknown
InChI: InChI=1S/C8H12Cl3N5/c1-4(2)13-7-15-5(8(9,10)11)14-6(12-3)16-7/h4,12-13H,1-3H3
charge 0 multiplicity 1
28 atoms
Cl -2.781222 -2.10806 -1.466306
Cl -0.160938 -3.315951 -0.611953
Cl -2.15075 -2.432251 1.482418
N  2.328478 1.005441 -0.043673
N  0.520142 -0.502044 -0.13086
N  0.174047 1.9141 0.053408
N  -1.732586 0.390545 -0.050083
N  -2.013104 2.728582 0.134803
C  3.338927 -0.078655 -0.109963
C  3.56658 -0.713422 1.282004
C  4.637617 0.494113 -0.711336
C  0.978684 0.807803 -0.036631
C  -0.826271 -0.612335 -0.135471
C  -1.174077 1.652061 0.044339
C  -1.420546 -2.029287 -0.197924
C  -3.476651 2.645934 0.134339
H  2.925602 -0.854574 -0.778774
H  2.637142 1.975651 0.049813
H  4.294878 -1.541803 1.209818
H  3.958857 0.032688 1.997813
H  2.619255 -1.120843 1.673416
H  5.059599 1.288573 -0.065123
H  4.462553 0.914772 -1.717635
H  5.397001 -0.301931 -0.797335
H  -1.54827 3.635496 0.201944
H  -3.897355 3.046243 1.075536
H  -3.756798 1.586334 0.040241
H  -3.904395 3.208822 -0.716027
