program: Gaussian 16
title: 12 shift P from cyclohept
version: ES64L-G16RevA.03
frameworkgroup: C1[X(C14H12)]
method: RPW6B95
basis: def2SVP
operation: Freq
keyword: #N
keyword: Geom=AllCheck
keyword: Guess=TCheck
keyword: SCRF=Check
keyword: GenChk
keyword: RPW6B95/def2SVP
keyword: Freq
converged: YES YES YES YES
title: Mulliken charges:
elementType: C C C C H C H C H C H C H H H C C C C H C H C H H H
charge: -0.034551 0.011596 0.012114 0.039591 -0.017931 -0.006004 -0.000444 -0.005646 -0.000175 -0.004013 0.012853 0.014352 -0.004708 -0.000002 -0.000228 0.034688 -0.009479 -0.012018 0.018134 -0.023476 0.010530 -0.010978 0.010413 -0.011613 -0.012054 -0.010951
chargesum: 0.00000
title: Mulliken charges with hydrogens summed into heavy atoms:
elementType: C C C C C C C C C C C C C C
charge: -0.052482 0.011594 0.011886 0.039591 -0.006448 -0.005820 0.008840 0.009644 0.034688 -0.032956 -0.022996 0.006521 -0.001524 -0.000538
chargesum: -0.00000
1716.lowfreq: -8.6527 -0.0007 0.0005 0.0006 3.3929 8.0344 41.1562 57.4943 85.7787
frequency: 41.1476 57.4772 85.7766 146.8850 224.8848 270.6898 297.6740 311.7095 385.0088 424.2922 443.5198 456.1645 520.0123 564.4217 610.4363 623.8339 628.2707 726.2748 751.7946 764.3417 795.9456 818.0724 845.3756 865.8257 873.2856 876.0210 901.7370 907.2716 958.1675 965.0541 1012.2885 1014.9499 1025.8514 1030.8810 1035.0567 1036.0944 1051.8470 1066.7887 1113.6504 1172.1036 1199.1008 1219.6095 1246.5746 1257.1526 1268.7696 1294.9478 1343.7151 1376.9506 1392.9446 1428.1508 1460.2356 1491.9581 1505.9928 1538.0461 1639.2133 1658.9489 1671.1620 1689.1180 1691.2603 1736.3459 3176.9737 3181.6919 3187.8501 3196.5237 3205.2551 3206.6854 3210.2125 3214.2954 3219.2432 3224.0180 3234.3579 3240.4369
redmass: 3.7923 4.2248 4.3160 3.8449 4.1232 4.9989 4.2932 3.3268 3.1110 3.0440 5.9942 5.9481 2.7847 1.7647 3.0388 5.7782 5.5339 1.7987 2.5589 1.6003 2.2501 1.4823 3.9565 1.6272 1.4981 2.3686 4.4456 1.8327 1.5016 2.5998 2.8487 1.7725 1.3202 1.3661 1.3237 2.1280 1.2971 1.9680 1.4687 1.0708 1.1080 1.5348 1.3369 1.5769 1.0806 1.3432 1.3541 1.5530 3.7050 1.6648 1.6093 2.4187 2.3247 2.5298 7.0770 6.4887 7.2961 7.0073 7.0888 5.5257 1.0878 1.0862 1.0849 1.0875 1.0919 1.0868 1.0933 1.0886 1.0967 1.0938 1.0957 1.0991
irintensity: 0.0480 0.1570 0.5457 1.0419 0.2629 1.1451 0.5425 0.5585 0.4952 0.1936 0.3700 0.5722 1.7972 39.7858 4.0329 6.0950 8.4472 24.7561 12.8945 26.8568 2.2995 5.2964 7.1433 14.5576 3.6904 0.3948 3.8845 13.2647 8.2360 7.7719 0.1722 0.1015 0.0914 0.3824 0.3099 1.4110 0.1431 3.6497 5.7379 0.0530 0.4961 0.1288 0.2943 1.7999 4.5904 0.7575 1.4401 2.5014 0.4058 5.0400 1.1439 5.3683 1.2185 23.5804 2.3267 12.1638 182.7020 7.0384 11.5569 10.8550 5.2419 6.6014 6.5549 1.4775 12.5464 8.0538 17.0710 0.4621 24.8023 14.7976 20.4085 7.7839
temp: 298.150 k
press: 1.00000 atm
elementType: 6 6 6 6 1 6 1 6 1 6 1 6 1 1 1 6 6 6 6 1 6 1 6 1 1 1
symmnumber: 1
zpe: 570072.2 jmol-1
zpe.correction: 0.217129 hartree
zpe.thermalcorrener: 0.228157 hartree
zpe.thermalcorrenthalpy: 0.229102 hartree
zpe.thermalcorrgfe: 0.179229 hartree
zpe.sumelectzpe: -540.769993 hartree
zpe.sumelectthermal: -540.758964 hartree
zpe.sumelectthermalent: -540.758020 hartree
zpe.sumelectthermalfe: -540.807892 hartree
dipole: 0.8350 0.1945 0.0864
dipole: 0.8617
quadrupole: -72.0116 -73.7803 -87.2173
quadrupole: 0.0599 -1.9993 -0.3087
quadrupole: 5.6581 3.8894 -9.5475 0.0599 -1.9993 -0.3087
hfenergy: -540.9871218 hartree
pointgroup: C01 [X(C14H12)]
dipole: 0.0941274 0.3166454 0.0761841 debye
dipolederiv: -0.144002 -0.0819143 -0.1137518 -0.0845745 -0.4414812 -0.0091566 -0.1773895 -0.2316688 0.0518649 -0.0257681 0.1938673 0.0127235 -0.0891942 -0.0094544 0.1132135 -0.203307 -0.5835569 -0.0936276 -0.1427865 -0.2116313 -0.0471151 -0.1382842 -0.3197057 -0.0638258 0.1239646 0.5383863 -0.0493035 0.0020864 0.0705923 0.0845209 0.2125257 0.5518877 0.1110846 0.1613682 0.3412825 -0.0319054 0.0708172 0.000026 0.0816052 -0.0323073 -0.0154466 -0.0163098 0.0834969 0.0339398 -0.0615627 -0.0805602 0.1378759 -0.0201913 0.2174381 0.5837257 0.0196145 -0.0895293 -0.2431758 0.1666678 0.0839132 -0.0414842 0.030254 -0.0065624 0.044074 0.017017 0.0249997 -0.0154623 -0.0924 -0.0969084 -0.1129886 -0.1647495 0.1872293 0.3141659 -0.0588642 0.0186483 0.4289887 0.1385471 0.0497871 -0.0679254 0.0856124 -0.0362806 0.0126626 0.0421666 0.0759345 0.0426044 -0.0247733 -0.0568968 0.0740911 0.003309 -0.1478152 -0.3060893 -0.0326923 -0.0954766 -0.3272298 -0.0243494 0.080604 -0.0404702 0.0165661 0.0108047 0.0205141 0.0508735 0.0199673 0.0254708 0.0092836 -0.0435813 -0.0095778 -0.0637274 -0.135932 -0.3213254 0.0025453 -0.0830075 0.051433 0.0576327 0.060704 -0.0467614 0.0378715 0.0268572 0.0218205 -0.0690947 0.0673634 -0.0201189 -0.0401251 0.10337 0.0108462 0.036982 -0.0196653 -0.1144223 0.0143083 0.0247131 0.0312617 0.0540768 0.1073916 0.0532689 0.0350152 0.0105222 -0.0640002 -0.060013 0.0403929 -0.0650004 -0.0039277 0.1166812 0.3548754 0.0100252 0.1975151 0.5075874 -0.0569965 -0.0416429 -0.2161268 -0.0643837 -0.0390559 -0.1001366 -0.111702 -0.0873823 -0.2909586 0.0204062 -0.0795145 0.0859085 0.0068379 -0.1336575 -0.168041 -0.0029992 -0.0733132 -0.1287351 -0.0151013 0.011454 0.1112755 -0.1012231 -0.0758416 -0.0915094 -0.0596268 -0.0030219 0.1828404 0.0488404 -0.059864 0.0149203 -0.06237 0.0087684 0.0269848 0.0989501 -0.0024786 0.0865822 0.014243 0.097097 -0.0028469 0.0138084 0.048302 0.0695762 -0.1114199 -0.0226535 -0.023464 0.0358292 -0.1372393 -0.0376377 -0.0079894 0.0891113 0.0536794 0.0223106 0.0377086 -0.0470788 -0.0269256 0.0304396 -0.019347 0.0725811 -0.1079476 -0.0369619 -0.0384161 0.0044439 -0.1492626 -0.0604923 -0.0130239 0.0361963 -0.0809771 0.078047 0.0412236 0.0329965 0.0242406 -0.0992087 -0.0469714 0.0366206 -0.0502719 0.073784 -0.0101468 -0.0177043 0.0951871 0.0133577 0.0524957 -0.0189342 0.1065251 0.0129729 0.0226801 0.0575695 -0.0598007 0.0497697 -0.0631781 -0.0477234 0.0452357 0.0570092 0.0578024 0.0711535 unknown
polarizability: 105.9699752|50.3830403|282.6214756|-34.3864951|10.9087732|129.6663928 unknown
InChI: InChI=1S/C14H12/c1-2-5-9-13(8-4-1)12-14-10-6-3-7-11-14/h1-12H
charge 0 multiplicity 1
26 atoms
C  -2.46897264 0.34504064 -1.42766502
C  -1.78606821 4.75109817 -0.57109159
C  -2.26117066 4.39874699 0.6446611
C  -2.18997854 1.57264282 -0.89964805
H  -2.11112822 0.16900819 -2.44389126
C  -2.43215385 3.06264433 1.15989953
H  -2.61453776 3.00869857 2.2338936
C  -1.35886778 3.87418138 -1.63280636
H  -0.85299241 4.37170448 -2.46068137
C  -2.40422122 1.87570388 0.51249731
H  -2.54273148 0.99546818 1.139774
C  -1.52284582 2.53856782 -1.76601555
H  -1.12801154 2.1022296 -2.68547794
H  -1.67760419 5.81692361 -0.77207231
H  -2.49940258 5.2047611 1.33865261
C  -3.16155487 -0.7903969 -0.82985298
C  -2.82160482 -2.08717272 -1.25260487
C  -4.20132443 -0.6669316 0.10803758
C  -3.45424952 -3.20665784 -0.73329676
H  -2.03586736 -2.2078309 -1.99736157
C  -4.83740109 -1.78833082 0.62446478
H  -4.53961225 0.3226821 0.40656232
C  -4.46289659 -3.06423607 0.21566363
H  -3.16099063 -4.19861332 -1.07275843
H  -5.6444143 -1.6627804 1.34446557
H  -4.96313325 -3.94082231 0.62273201
