program: Gaussian 16
title: CHT boat inversion
version: ES64L-G16RevA.03
method: RPW6B95
basis: def2SVP
operation: Freq
keyword: #N
keyword: Geom=AllCheck
keyword: Guess=TCheck
keyword: SCRF=Check
keyword: GenChk
keyword: RPW6B95/def2SVP
keyword: Freq
converged: YES YES YES YES
title: Mulliken charges:
elementType: C C C C C C C H H H H H H H C C C H H H O Rh Rh O C O C H H H O C O C H H H O C O C H H H O C O C H H H
charge: 0.162184 -0.018654 -0.083558 0.016355 -0.001668 -0.001419 0.013633 0.082874 0.032752 0.078583 0.002495 0.000202 -0.001213 0.000189 -0.116997 0.104584 0.080114 0.085124 0.050704 0.033858 -0.210696 0.119565 0.510812 -0.367937 0.273499 -0.332393 0.041456 0.052003 0.040458 0.045721 -0.360305 0.274155 -0.335115 0.045679 0.038370 0.055772 0.044241 -0.348052 0.277368 -0.332901 0.040904 0.048841 0.044136 0.049801 -0.326589 0.277925 -0.366227 0.040405 0.048412 0.046823 0.043729
chargesum: -0.00000
title: Mulliken charges with hydrogens summed into heavy atoms:
elementType: C C C C C C C C C C O Rh Rh O C O C O C O C O C O C O C O C
charge: 0.245058 0.014097 -0.004975 0.016557 0.000826 -0.002632 0.013821 -0.116997 0.104584 0.249801 -0.210696 0.119565 0.510812 -0.367937 0.273499 -0.332393 0.179638 -0.360305 0.274155 -0.335115 0.184062 -0.348052 0.277368 -0.332901 0.183682 -0.326589 0.277925 -0.366227 0.179370
chargesum: 0.00000
1716.lowfreq: -45.8271 -10.7726 -6.8348 -5.8209 -0.0004 -0.0002 -0.0001 19.7411 22.2539
frequency: -45.7635 19.6438 22.2209 23.4007 33.0056 40.1011 49.6241 52.5253 60.5509 61.4632 66.3418 68.7788 70.2608 83.4263 93.4239 114.4605 125.3462 131.2584 139.0509 141.1795 152.0164 167.6101 175.7151 188.8334 202.3424 207.4433 216.4391 234.9990 240.6972 243.0220 246.5256 283.9265 289.2941 297.7528 302.7491 313.8011 317.4053 326.4059 341.3205 352.4202 385.7701 387.3082 410.4001 429.5312 472.8555 507.3226 579.6658 581.7516 590.7491 591.6156 594.9994 611.3327 625.3899 627.5570 627.7046 629.3548 679.8683 715.7946 717.2750 729.5892 737.9663 741.6978 795.3710 803.4978 809.8594 843.4545 890.6581 894.7492 935.1695 943.8709 978.7064 979.5362 987.7255 989.5792 993.2259 1024.9495 1029.0593 1029.6570 1030.1557 1030.3193 1033.0439 1041.9651 1046.8491 1052.6313 1054.7809 1054.8555 1056.0585 1098.9922 1130.6466 1218.3796 1256.1305 1284.3975 1300.1856 1319.4492 1361.3382 1361.7398 1362.1834 1362.6585 1364.4653 1385.2214 1399.3508 1423.0798 1430.3752 1436.8549 1437.1670 1437.8738 1438.6281 1450.2994 1451.0017 1451.7830 1452.1133 1453.3608 1476.7734 1497.4196 1500.8507 1503.3216 1516.2484 1631.6329 1634.4710 1658.3622 1708.1386 1723.2972 1725.8637 1752.1790 1789.8581 3033.0020 3069.8986 3091.3270 3092.3532 3092.6631 3093.0801 3166.4941 3181.9815 3183.1761 3183.3183 3184.1336 3184.7967 3188.4563 3201.2388 3204.8321 3214.0325 3216.9769 3220.5519 3223.0164 3223.4519 3223.6376 3223.9089
redmass: 3.9129 4.9530 1.1128 1.1242 5.6087 3.4672 1.3309 1.1943 2.5953 3.3319 2.7852 2.7129 3.7567 2.4632 1.3979 5.6775 3.9902 6.0618 5.5410 7.5494 13.1948 5.6547 4.5882 5.8458 15.2404 5.2051 6.4948 6.2897 6.2358 6.9549 6.6999 4.4826 6.0841 6.9825 8.8132 4.3572 4.7654 6.5759 5.4143 5.6847 9.1758 8.8638 6.2630 6.4567 2.6762 2.8399 4.5043 4.5693 2.6701 4.6904 4.8273 2.6238 2.6922 2.7511 2.3423 1.9129 7.4338 7.6103 7.4822 7.2616 7.1116 2.3756 1.6394 2.8590 3.5004 1.9193 2.8333 4.7452 3.0457 1.9474 5.2575 5.7105 4.3642 3.0215 5.4570 1.2793 1.5610 1.5385 1.5697 1.5396 1.2804 1.7516 1.4910 1.8498 1.8540 1.8652 1.8641 2.2552 2.1982 1.3380 1.0924 1.1620 1.1564 1.5799 1.3815 1.3214 1.3289 1.4472 1.3137 2.2489 1.2807 1.0741 1.0530 1.0659 1.0621 1.0628 1.0573 1.1006 1.1029 1.3307 1.0692 1.0878 1.7645 7.7403 6.2412 7.2393 8.2250 9.1677 9.0404 9.4307 8.9553 10.0043 7.0578 6.1683 11.6059 1.0816 1.0357 1.0378 1.0371 1.0376 1.0370 1.1001 1.1017 1.0852 1.0998 1.1013 1.1002 1.0859 1.0870 1.1076 1.0929 1.0931 1.0962 1.1082 1.1083 1.1073 1.1078
irintensity: 0.1327 0.2243 0.3199 1.3930 0.1526 1.4444 0.5628 0.3816 0.1305 1.1697 1.6610 0.5331 0.3135 4.5558 0.2038 0.3032 0.1379 2.4854 1.1319 1.8242 0.1313 6.8042 0.5065 28.3287 0.1539 3.1879 0.2225 0.3220 0.4544 0.0220 0.1108 0.1061 0.7202 0.7426 7.9209 3.3580 1.7679 0.0554 3.5886 7.8692 48.9812 48.3027 5.2893 1.5714 2.0706 16.0616 0.2305 0.1299 2.6174 0.2503 2.4984 0.5118 0.7934 7.2989 2.3511 63.5154 42.0703 111.2337 78.5097 5.1366 3.1767 36.2340 15.9750 11.1905 54.5719 3.1938 29.9842 22.5029 15.7448 13.3944 0.8153 0.4799 0.3446 0.8428 1.5416 0.2018 2.1903 1.0461 1.5831 3.7839 2.2632 0.2475 4.5014 2.0224 12.5921 14.9058 3.9001 9.5948 10.1040 14.6776 0.3855 21.1178 2.4087 25.9565 1.5381 5.0626 4.2448 8.0989 17.7569 99.7179 3.5267 13.5969 6.5954 1.6267 5.5519 4.7594 66.3997 34.7052 8.6854 7.5994 30.7955 7.9235 0.2584 375.4549 565.1276 268.5047 131.8041 20.6805 15.2736 1.6010 5.3757 633.0082 1.4466 3.2651 143.5234 0.4978 1.0728 1.2958 1.4949 1.1180 1.2317 0.9859 1.7011 11.4265 3.1375 1.3888 2.3035 2.8554 8.2361 1.0350 0.3612 11.2914 30.4079 1.3109 1.4101 1.6701 1.8303
temp: 298.150 k
press: 1.00000 atm
elementType: 6 6 6 6 6 6 6 1 1 1 1 1 1 1 6 6 6 1 1 1 8 45 45 8 6 8 6 1 1 1 8 6 8 6 1 1 1 8 6 8 6 1 1 1 8 6 8 6 1 1 1
symmnumber: 1
zpe: 1008956.9 jmol-1
zpe.correction: 0.384291 hartree
zpe.thermalcorrener: 0.417071 hartree
zpe.thermalcorrenthalpy: 0.418015 hartree
zpe.thermalcorrgfe: 0.316117 hartree
zpe.sumelectzpe: -1597.746732 hartree
zpe.sumelectthermal: -1597.713952 hartree
zpe.sumelectthermalent: -1597.713008 hartree
zpe.sumelectthermalfe: -1597.814906 hartree
dipole: 3.6136 -0.6917 1.4326
dipole: 3.9482
quadrupole: -193.6085 -186.8678 -176.8128
quadrupole: -11.0614 5.7655 4.1836
quadrupole: -7.8454 -1.1048 8.9502 -11.0614 5.7655 4.1836
hfenergy: -1598.1310231 hartree
pointgroup: C01 [X(C18H22O9Rh2)]
dipole: 1.4223712 -0.3636834 0.5074311 debye
polarizability: 378.2082175|0.0536368|260.2090286|-1.3678186|-13.4800786|250.2173809 unknown
InChI: InChI=1S/C10H10O.4C2H3O2.2Rh/c1-9(11)8-10-6-4-2-3-5-7-10;4*1-2(3)4;;/h2-7,10H,1H3;4*1H3;;/q;4*-2;2*+4
charge 0 multiplicity 1
51 atoms
C  2.80485808 -0.18103306 -0.77058918
C  3.94397352 0.57888928 -1.40221045
C  3.09211563 -1.0369891 0.45815151
C  4.257875 -1.51974826 0.91908779
C  5.27067717 0.40277634 -1.32140396
C  5.61180353 -1.37645339 0.4195959
C  6.04742535 -0.55210626 -0.5514403
H  2.32381091 -0.83724873 -1.5149276
H  3.60151139 1.38608518 -2.04910178
H  2.19141902 -1.32278207 1.00139555
H  5.86796723 1.07972414 -1.93371634
H  4.16764941 -2.15888647 1.79906205
H  6.35443338 -2.00445309 0.91115127
H  7.11369148 -0.5707528 -0.77671782
C  1.73731991 0.7208249 -0.23099549
C  2.10387976 2.05585005 0.2702935
C  2.23551632 2.29644379 1.7341244
H  1.30568971 1.98559221 2.22484593
H  3.04660856 1.67506841 2.13674833
H  2.44063754 3.35561822 1.91440612
O  2.21599095 2.89518196 -0.59986998
Rh -0.13886411 0.1978015 -0.09058717
Rh -2.46197179 -0.4924074 0.13494096
O  0.28549039 -1.71835762 -0.65363766
C  -0.64693525 -2.58108364 -0.69488585
O  -1.84786465 -2.37143851 -0.41438261
C  -0.25546771 -3.9568501 -1.14991978
H  -0.19892005 -3.95907559 -2.24541897
H  0.73426829 -4.21664047 -0.76450177
H  -1.00338991 -4.68792526 -0.83583488
O  -0.71368091 2.06032569 0.50746369
C  -1.94230501 2.28901303 0.73330571
O  -2.866428 1.44755121 0.66264392
C  -2.2988831 3.70358395 1.08490468
H  -1.51782539 4.14975027 1.70636498
H  -2.35866922 4.28632254 0.15757532
H  -3.26828779 3.73821654 1.58649855
O  -0.58188871 0.64141663 -2.02751478
C  -1.75070102 0.44833508 -2.48147182
O  -2.72024361 -0.00248063 -1.82988547
C  -1.95767 0.7807556 -3.92982754
H  -1.41918483 0.04832395 -4.54258389
H  -3.02019688 0.75306003 -4.17882558
H  -1.53302435 1.76531139 -4.1480606
O  -2.06937306 -0.93975901 2.09342363
C  -0.9165382 -0.76749864 2.54208608
O  0.07708315 -0.32881023 1.88001883
C  -0.65798482 -1.08420916 3.98636814
H  -0.45216766 -0.15220522 4.52556843
H  -1.52502598 -1.57834922 4.42858509
H  0.23117533 -1.71638596 4.0752319
