program: Gaussian 16
title: semib 12 shift
version: ES64L-G16RevC.01
method: RPW6B95
basis: def2SVP
operation: Freq
keyword: #N
keyword: Geom=AllCheck
keyword: Guess=TCheck
keyword: SCRF=Check
keyword: GenChk
keyword: RPW6B95/def2SVP
keyword: Freq
converged: YES YES NO NO
title: Mulliken charges:
elementType: C C C C H C H C H C H C H C O C H H H Rh Rh O O O O O O O C C C C C O C C C H H H H H H H H H H H H H H
charge: -0.075506 0.020415 0.017337 0.033435 0.039031 0.010724 0.005801 0.005031 0.006912 0.073789 0.002766 0.081177 0.033418 0.083842 -0.221469 0.043289 0.028717 0.021149 0.066513 0.035032 0.600567 -0.336425 -0.362738 -0.342969 -0.352933 -0.343807 -0.341430 -0.347558 0.277441 0.283785 0.280001 0.279956 0.045671 -0.337456 0.038812 0.041565 0.042130 0.047429 0.052880 0.043450 0.051587 0.046088 0.037970 0.036279 0.045692 0.050017 0.038002 0.044458 0.055854 0.007132 0.007147
chargesum: -0.00000
title: Mulliken charges with hydrogens summed into heavy atoms:
elementType: C C C C C C C C C O C Rh Rh O O O O O O O C C C C C O C C C
charge: -0.036475 0.027547 0.024484 0.033435 0.016525 0.011943 0.076555 0.114596 0.083842 -0.221469 0.159668 0.035032 0.600567 -0.336425 -0.362738 -0.342969 -0.352933 -0.343807 -0.341430 -0.347558 0.277441 0.283785 0.280001 0.279956 0.189430 -0.337456 0.174457 0.173552 0.180443
chargesum: 0.00000
1716.lowfreq: -14.0627 -9.3863 -3.1417 -0.0006 -0.0001 0.0008 13.2302 27.9026 31.9115
frequency: 11.4421 27.8954 31.8526 37.7014 41.4889 46.9251 59.6341 63.1355 64.1414 69.9069 73.3962 82.1116 87.9241 99.7023 105.9419 125.8697 128.1371 141.7440 148.0092 158.0115 172.0286 187.3781 201.0526 215.4832 226.4407 238.4489 243.0527 244.5122 246.1299 277.9147 291.1344 294.0364 295.0723 303.4558 318.6543 324.5796 326.3796 328.6293 335.3697 346.7459 366.9762 386.2613 387.2631 443.7346 519.0095 557.6842 570.4989 578.3698 581.5083 592.7138 593.9723 598.7413 612.2822 613.2457 626.0313 629.1396 629.5654 714.9241 715.7801 736.0552 742.3767 760.4820 778.0384 836.2838 845.8182 878.4325 898.2120 909.4846 939.1911 977.5956 979.7416 981.4828 991.1787 995.8682 1003.9023 1029.0184 1029.9642 1032.2129 1033.6216 1034.8948 1041.2124 1043.9271 1052.6037 1054.4647 1055.2736 1056.0153 1056.9648 1060.6977 1219.3281 1254.4946 1275.7166 1279.2919 1307.1988 1362.2578 1363.1068 1364.7102 1366.4754 1383.1184 1388.1345 1435.6170 1436.6999 1436.9970 1437.6950 1438.9286 1450.4048 1451.0606 1452.1058 1453.6315 1460.0397 1464.3114 1469.0082 1511.3972 1514.0787 1518.4222 1525.8412 1527.0391 1557.0037 1619.6636 1623.0569 1629.9652 1649.5171 1689.1490 1715.6733 1719.6184 1810.5869 3071.4922 3090.0094 3091.0631 3092.0217 3092.5664 3167.0995 3182.4316 3182.8543 3184.4315 3184.6139 3193.9540 3197.8151 3203.3244 3206.5373 3208.0222 3214.8543 3218.6355 3222.5111 3222.6887 3223.7902 3224.4671 3290.9606
redmass: 5.5781 1.0990 2.6864 1.4823 1.1036 2.7134 2.9720 3.2391 3.5342 3.1006 3.8925 6.3383 2.2016 3.2641 3.6051 4.3074 5.0972 4.5095 11.1229 10.6131 5.1307 4.5470 15.2831 6.5938 5.1605 6.0205 6.6331 6.3351 6.7440 1.5202 6.6783 5.8955 4.0372 3.5060 12.8874 2.5790 2.9265 6.1987 7.4057 8.9703 3.8396 9.0534 9.1847 6.5896 6.6217 3.0834 1.9974 4.4005 4.4868 2.4016 4.2840 4.8553 2.6324 2.6073 2.7012 2.7625 2.7637 7.5704 7.6370 7.2613 7.1530 3.8426 1.9082 1.4210 3.1748 4.4809 4.3429 1.6280 1.2057 2.6526 5.6458 5.5185 5.7474 5.8825 1.7787 1.5393 1.5361 1.5398 1.4721 1.3688 1.3707 1.7542 1.8560 1.8676 1.8705 1.8798 1.8774 1.3857 1.7994 1.1303 1.5062 1.2742 1.1459 1.3173 1.3160 1.3089 1.3033 1.6025 1.3507 1.0755 1.0695 1.0651 1.0557 1.6482 1.0787 1.0852 1.0776 1.0674 1.1149 1.2117 1.3654 7.0595 6.8405 6.6136 3.9080 3.8555 4.1504 8.8453 8.8491 8.6452 9.2769 7.8915 9.4719 5.1177 10.6343 1.0374 1.0375 1.0379 1.0379 1.0375 1.1003 1.0998 1.1002 1.1002 1.0997 1.0846 1.0874 1.1061 1.0892 1.0887 1.0933 1.1082 1.1078 1.1083 1.0965 1.1084 1.0880
irintensity: 0.5625 0.3578 0.1597 0.1081 0.6397 0.1501 0.5689 0.6838 1.1795 2.5119 1.4856 5.9583 1.4279 0.2172 2.1438 0.2741 1.1067 0.2512 0.3283 1.8305 1.7130 6.6264 0.0654 0.1991 11.7289 0.9092 0.1539 0.4010 0.0962 0.1607 3.0904 2.2703 1.9873 5.2931 6.3660 0.9142 6.3078 4.0237 4.2306 10.8072 15.3941 43.3408 37.1930 0.0722 8.3102 12.9105 26.2492 0.6922 3.4827 9.2060 0.9122 4.4649 0.8210 10.6432 0.9401 8.6993 8.5344 114.0140 93.5605 0.9923 6.0438 39.9399 40.7061 15.6887 28.9192 1.7297 2.1475 6.5667 67.9056 0.8863 1.3268 0.5590 0.6242 1.5600 16.6393 0.9151 3.6198 0.8536 2.8065 0.3923 1.1305 31.8735 3.2748 13.6798 7.6991 7.3649 2.6404 0.5134 29.0463 2.3355 126.8598 15.6669 14.2170 4.2799 4.7475 2.0285 3.1808 71.8634 20.0887 9.7067 6.2371 7.0372 74.7895 4.2923 1.6887 45.8072 25.2067 9.8289 21.0790 1.7563 10.1216 485.3664 166.3359 576.0295 89.1137 35.1773 148.8307 88.7159 4.5225 209.1587 0.2339 3.4908 591.4387 96.1116 233.1668 6.3630 1.3474 1.2771 1.0314 1.1113 2.2202 2.0138 2.4932 2.1522 2.1386 4.3573 0.7074 4.3696 3.8590 1.4495 8.3631 3.0308 1.6103 2.0742 15.8282 0.9817 1.0734
temp: 298.150 k
press: 1.00000 atm
elementType: 6 6 6 6 1 6 1 6 1 6 1 6 1 6 8 6 1 1 1 45 45 8 8 8 8 8 8 8 6 6 6 6 6 8 6 6 6 1 1 1 1 1 1 1 1 1 1 1 1 1 1
symmnumber: 1
zpe: 1017434.0 jmol-1
zpe.correction: 0.387520 hartree
zpe.thermalcorrener: 0.420321 hartree
zpe.thermalcorrenthalpy: 0.421265 hartree
zpe.thermalcorrgfe: 0.320119 hartree
zpe.sumelectzpe: -1597.828385 hartree
zpe.sumelectthermal: -1597.795585 hartree
zpe.sumelectthermalent: -1597.794640 hartree
zpe.sumelectthermalfe: -1597.895786 hartree
dipole: 4.6118 -2.0810 1.4916
dipole: 5.2749
quadrupole: -176.9952 -197.4652 -180.5448
quadrupole: -15.0628 8.1286 16.2608
quadrupole: 8.0066 -12.4635 4.4569 -15.0628 8.1286 16.2608
hfenergy: -1598.2159053 hartree
pointgroup: C01 [X(C18H22O9Rh2)]
dipole: -1.8272719 -0.7781148 -0.6020569 debye
polarizability: 367.167955|32.8530044|278.6722337|13.3354105|-5.0352365|260.7922931 unknown
InChI: InChI=1S/C10H10O.4C2H3O2.2Rh/c1-9(11)8-10-6-4-2-3-5-7-10;4*1-2(3)4;;/h2-8H,1H3;4*1H3;;/q;4*-2;2*+4
charge 0 multiplicity 1
51 atoms
C  -1.47133061 1.75696488 1.17268785
C  -5.00631981 -1.07282295 0.44453168
C  -5.04317804 -0.43590182 -0.75449411
C  -2.4832766 0.94247925 0.65649634
H  -1.20437514 1.55896682 2.21046782
C  -4.1081499 0.5206573 -1.25928483
H  -4.29883746 0.83898552 -2.2846216
C  -4.01977749 -0.93513164 1.46935145
H  -4.1513847 -1.6003189 2.32289722
C  -3.03004996 1.10492563 -0.67314952
H  -2.47567172 1.78400112 -1.31080622
C  -2.95436451 -0.09868465 1.55152715
H  -2.33761818 -0.2011203 2.44501435
C  -1.02522942 3.13069406 0.81552525
O  -0.56839759 3.81184273 1.70800644
C  -1.11941928 3.6768508 -0.58373475
H  -2.16578616 3.86057283 -0.8595068
H  -0.57962965 4.62671052 -0.61043295
H  -0.68840366 2.97263926 -1.30410695
Rh 0.05770254 0.21459049 0.19522878
Rh 1.94985772 -1.09393019 -0.47393935
O  1.35187013 1.78045913 0.39215458
O  -0.18761301 0.71135058 -1.77820561
O  -1.07072721 -1.47459236 -0.09868303
O  0.4152953 -0.38250528 2.11246988
O  0.7049599 -2.68590369 -0.72450209
O  2.1999789 -1.58656774 1.49058162
O  3.1221026 0.54848035 -0.20350005
C  2.5845511 1.62264863 0.16999356
C  0.61879888 0.25055016 -2.63891445
C  -0.52054375 -2.54338088 -0.48548183
C  1.40620764 -1.13168212 2.35216338
C  3.47644832 2.80581315 0.40068955
O  1.58200592 -0.51651017 -2.39606172
C  0.41474082 0.68696598 -4.06036264
C  -1.40322799 -3.74729906 -0.64140798
C  1.66769183 -1.47336624 3.78933382
H  2.89363331 3.72919078 0.40984338
H  3.96111486 2.68759083 1.37748197
H  4.26187235 2.83813224 -0.35940435
H  0.82892391 1.69569799 -4.17984196
H  0.93150747 0.01138922 -4.74515064
H  -0.65300012 0.73483769 -4.29175337
H  -2.44045821 -3.443087 -0.80117196
H  -1.04510919 -4.3728616 -1.46316827
H  -1.34952828 -4.33958791 0.28045895
H  0.72746639 -1.54665177 4.34184475
H  2.24000439 -2.40084391 3.86239816
H  2.2579977 -0.66328582 4.2351779
H  -5.8034282 -1.78694074 0.65003558
H  -5.86476314 -0.68817018 -1.42427932
