program: Gaussian 09
title: 000033806
version: EM64L-G09RevD.01
frameworkgroup: C1[X(C11H11NO3)]
method: RPBEPBE
basis: SDD
operation: Freq
keyword: #p
keyword: freq=noraman
keyword: PBEPBE/SDD
title: #p freq=noraman PBEPBE/SDD
converged: NO YES NO YES
title: Mulliken charges:
elementType: O O O N C C C C C C C C C C C H H H H H H H H H H H
charge: -0.215066 -0.224533 -0.197500 0.041559 0.183939 0.205696 0.195386 0.348068 0.379491 -0.592719 -0.544533 0.148836 -0.768530 -0.818930 -0.808146 0.250999 0.268952 0.263843 0.263907 0.221619 0.235248 0.229782 0.229775 0.231935 0.239016 0.231905
chargesum: 0.00000
title: Mulliken charges with hydrogens summed into heavy atoms:
elementType: O O O N C C C C C C C C C C C
charge: -0.215066 -0.224533 -0.197500 0.041559 0.183939 0.205696 0.195386 0.348068 0.379491 -0.341720 -0.275581 0.148836 -0.019161 -0.124125 -0.105289
polarizability: 2.51724287e+02 -1.88341548e+00 1.48064817e+02 3.80889601e-03 5.24755273e-03 6.65502868e+01
1716.lowfreq: -7.7295 -0.0010 -0.0008 -0.0004 5.4831 9.4700 58.1006 72.5260 99.4702
frequency: 58.0458 72.5095 99.4699 108.0853 118.0685 143.4123 171.5129 203.7587 228.4252 232.1445 295.1641 324.5799 333.1585 358.4884 366.6149 410.6683 437.4338 513.7615 524.8386 577.6736 599.3390 647.4599 657.0016 691.5485 720.4292 739.6810 750.2385 773.8169 856.9726 875.9498 885.0441 999.0176 1004.2317 1026.7095 1032.3532 1034.0546 1053.0318 1082.2645 1113.4635 1138.3378 1173.1056 1212.1877 1254.0935 1289.7341 1326.4531 1343.5052 1387.7880 1398.2044 1406.6740 1412.0567 1435.5867 1452.8356 1455.8384 1460.8390 1465.4698 1477.3567 1483.5636 1493.7439 1558.6524 1582.2548 1635.4803 2974.4893 2975.2982 2996.0444 3046.0614 3048.7371 3074.9914 3087.9869 3093.8466 3103.7685 3140.7160 3167.4887
redmass: 3.8463 5.6510 1.4910 2.0688 1.0688 6.8333 1.5576 1.9515 3.1192 3.1567 2.8264 5.9972 4.2902 5.1614 4.9755 5.5196 2.7917 6.6184 4.3253 6.7490 4.4358 3.8536 5.7995 10.5085 7.1033 6.5038 3.8535 6.8415 3.0605 1.3608 1.3988 1.5238 1.5779 2.2607 1.4526 1.4900 1.6341 3.0242 4.6018 3.7920 3.5516 3.9682 1.3008 8.4778 7.0604 11.3869 3.6622 1.2298 1.2354 1.3397 1.9594 1.0434 2.4355 1.0463 1.1311 1.0446 1.1423 1.9789 9.8856 8.1215 7.5440 1.0379 1.0387 1.0369 1.0968 1.0968 1.0961 1.0984 1.0980 1.1008 1.0920 1.0933
irintensity: 0.0598 0.1354 0.0068 2.2076 0.1775 1.0624 3.3656 0.5974 1.8990 0.0242 0.8320 0.6296 0.6363 0.6080 0.4561 2.7728 10.6452 1.5094 3.3867 3.0727 0.4851 0.1761 3.5682 2.3318 3.6739 20.5149 0.0066 6.2695 4.1224 32.0478 2.7930 11.8160 11.1321 21.9102 21.5125 0.0894 0.0965 5.9570 24.0737 110.8365 5.1747 171.3472 0.3922 181.6840 123.6557 167.2064 8.0766 8.7072 31.3818 15.5426 20.9563 12.5638 2.8588 0.2958 26.0108 34.2010 2.0033 10.5321 144.4204 10.4740 48.9888 53.6655 11.4443 6.3234 36.0964 0.1029 5.1101 25.2559 11.0530 17.1903 9.8461 2.1947
temp: 298.150 k
press: 1.00000 atm
elementType: 8 8 8 7 6 6 6 6 6 6 6 6 6 6 6 1 1 1 1 1 1 1 1 1 1 1
symmnumber: 1
zpe: 518423.3 jmol-1
zpe.correction: 0.197457 hartree
zpe.thermalcorrener: 0.211500 hartree
zpe.thermalcorrenthalpy: 0.212444 hartree
zpe.thermalcorrgfe: 0.156715 hartree
zpe.sumelectzpe: -705.023561 hartree
zpe.sumelectthermal: -705.009518 hartree
zpe.sumelectthermalent: -705.008574 hartree
zpe.sumelectthermalfe: -705.064303 hartree
dipole: -7.5247 2.7125 -0.0003
dipole: 7.9987
quadrupole: -98.2580 -83.0554 -87.9237
quadrupole: 8.3851 -0.0012 -0.0003
quadrupole: -8.5123 6.6903 1.8220 8.3851 -0.0012 -0.0003
hfenergy: -705.2210178 hartree
pointgroup: C01 [X(C11H11N1O3)]
dipole: 2.9811357 1.0079293 0.0006292 debye
dipolederiv: -0.64992 0.1182168 -0.0000444 -0.0761705 -0.5436749 -0.0000932 0.0000372 -0.0000683 -0.1015027 -0.9676055 0.1334763 -0.0000859 0.4398593 -0.6003422 0.0000271 -0.0002356 0.0000894 -0.2355026 -0.7183351 -0.2170382 -0.0000603 -0.4853256 -0.7754457 0.000023 -0.0001948 -0.0001131 -0.2253205 2.3505685 0.2825603 0.0003196 0.2717946 1.205869 -0.0000481 0.0004842 -0.0000012 0.1896187 -0.4169963 0.1844208 -0.000028 0.203335 -0.2454678 -0.0000462 0.0000308 0.0000056 0.0049483 0.5419535 0.0189306 0.0000661 -0.054221 0.1397798 0.0000061 0.0000361 0.000027 0.0789794 0.7764012 -0.2320538 0.0000729 0.2573934 0.3851137 0.000025 0.0000908 -0.0002124 -0.0007215 0.1303549 0.2332178 0.0000677 0.619409 -0.0807901 0.0000806 0.0001622 0.0000281 -0.0495117 0.321001 -0.136649 0.0000456 -0.3999973 0.17776 -0.0000159 0.0001265 -0.0000331 -0.04593 0.2237834 -0.1224547 0.0000227 0.1016194 0.082415 0.0000386 0.0000535 0.0000173 -0.1576462 -0.3573315 -0.0196143 -0.0000413 -0.0679914 0.0283643 0.0000234 -0.0000651 0.0000441 -0.1709952 -1.1475303 -0.364195 -0.0002109 -0.8187492 0.223226 -0.0000095 -0.0003266 0.0000188 0.0604542 0.056228 0.235325 0.000124 0.0780282 -0.1167201 0.0000834 0.0003091 0.0005398 0.0252315 -0.1309394 -0.0817761 -0.000037 -0.0352047 0.0468349 -0.0000087 -0.0000924 -0.0000091 0.0652382 -0.2376994 0.1125179 -0.0000265 0.0164113 0.0446225 0.000022 -0.0003031 0.0000903 0.0576575 0.0878335 0.0036942 0.0000004 -0.0253458 -0.0832311 -0.0000479 -0.0000049 -0.0000315 0.1492974 0.0802727 0.0048034 0.000002 0.024756 -0.0370337 -0.0000446 0.0000088 -0.0000551 0.1740322 0.03395 0.0051766 -0.0842974 -0.0192776 0.0585593 -0.0018936 -0.0678215 0.0302637 -0.0000177 0.0335255 0.0051838 0.084502 -0.0195054 0.0588159 0.0020859 0.0678206 -0.030198 0.0005505 -0.0186988 -0.1676772 -0.0003612 -0.0645712 -0.0096324 -0.0001976 -0.0002846 -0.0003561 0.10836 0.0797952 0.0932519 0.0000018 -0.0423751 -0.1356995 -0.00002 -0.0000005 -0.0000131 0.1106302 -0.0416016 -0.013846 -0.0830599 0.0132749 0.0787953 0.0770706 -0.1333081 0.0308522 -0.040493 -0.0416653 -0.0138304 0.0830637 0.013327 0.078812 -0.077061 0.1333228 -0.0308515 -0.0404307 -0.0316034 0.0156226 -0.0831735 0.0151643 0.0763758 -0.076559 -0.1317284 -0.0292831 -0.0352136 0.0759783 -0.0927222 -0.0000691 0.0394604 -0.1335726 -0.0001584 0.0000532 -0.0001712 0.1132095 -0.031719 0.015459 0.0832072 0.014902 0.0762668 0.0767182 0.1318296 0.0294205 -0.0349221 unknown
polarizability: 251.7581651|-0.1845456|148.030936|0.0231365|0.0095898|66.5502904 unknown
InChI: InChI=1S/C11H11NO3/c1-6-4-9-8(3)11(12(13)14)15-10(9)5-7(6)2/h4-5H,1-3H3
charge 0 multiplicity 1
26 atoms
O  -1.056049 -1.30149 -0.000542
O  -4.060366 0.66455 -0.000868
O  -3.732761 -1.611992 -0.000738
N  -3.29816 -0.394703 -0.000486
C  0.222494 0.642099 -0.000004
C  0.25416 -0.781379 -0.000312
C  -1.173528 1.042341 -0.000043
C  2.668016 0.62382 0.000183
C  2.658425 -0.823162 -0.000122
C  1.456621 1.343637 0.000252
C  1.434578 -1.532498 -0.000372
C  -1.886382 -0.158518 -0.000344
C  -1.71103 2.44303 0.000187
C  3.990591 1.369004 0.000465
C  3.965874 -1.5915 -0.000091
H  1.474758 2.438833 0.000462
H  1.410368 -2.625494 -0.00062
H  -2.3529 2.622169 -0.880448
H  -2.355794 2.620811 0.878945
H  -0.890635 3.179236 0.002017
H  3.833952 2.460489 0.000502
H  4.601472 1.116835 0.888327
H  4.601815 1.116947 -0.887189
H  4.579983 -1.346488 0.887624
H  3.792304 -2.679964 -0.000878
H  4.580794 -1.345314 -0.886908
