program: Gaussian 16
title: Input
version: ES64L-G16RevA.03
method: RB3LYP
basis: def2SVP
operation: Freq
keyword: #N
keyword: Geom=AllCheck
keyword: Guess=TCheck
keyword: SCRF=Check
keyword: GenChk
keyword: RB3LYP/def2SVP
keyword: Freq
converged: YES YES YES YES
title: Mulliken charges:
elementType: H C C N C C C C C C C O H H H H C C N C C C H H H H C C C C C C H H H H H C C C H H H H O Rh C C C C C C H H H C H H H C H H H C H H H C H H H
charge: -0.024191 -0.132135 0.188361 -0.234704 0.207164 -0.060071 0.147558 -0.040247 0.046142 0.021810 0.001849 -0.244509 -0.008561 -0.015678 -0.014138 -0.029101 0.238919 -0.024525 -0.237981 0.081452 0.136862 0.004077 0.028970 0.008889 0.045106 0.000540 0.165994 -0.064973 -0.023379 0.018779 0.025631 0.024664 -0.019638 0.002702 -0.019113 -0.021441 -0.016642 -0.027279 0.220294 -0.149965 0.014514 0.027689 0.103361 0.057210 -0.358963 0.068097 -0.218637 -0.247526 -0.101794 -0.166157 -0.081587 0.127567 -0.007989 0.003010 0.008093 0.128437 0.010811 0.010087 -0.011018 0.115340 0.007931 0.015617 -0.006018 0.130739 0.010370 0.009561 -0.005324 0.130925 0.023335 -0.009327 0.004149
chargesum: 0.00000
title: Mulliken charges with hydrogens summed into heavy atoms:
elementType: C C N C C C C C C C O C C N C C C C C C C C C C C C O Rh C C C C C C C C C C
charge: -0.156326 0.188361 -0.234704 0.207164 -0.060071 0.147558 -0.069348 0.032004 0.006132 -0.006712 -0.244509 0.238919 0.004446 -0.237981 0.090341 0.181968 0.004617 0.165994 -0.084611 -0.020676 -0.000334 0.004190 0.008022 -0.027279 0.262497 0.010606 -0.358963 0.068097 -0.218637 -0.247526 -0.101794 -0.166157 -0.081587 0.130682 0.138317 0.132870 0.145347 0.149082
chargesum: -0.00000
1716.lowfreq: -208.3078 -4.2175 -0.0004 0.0005 0.0008 1.0021 3.7859 17.5357 24.5244
frequency: -208.3077 17.4569 24.5050 27.0718 36.1519 47.6449 53.6900 68.6384 73.1342 82.2697 95.7664 100.7362 110.7040 120.8760 122.0975 136.0416 155.6731 159.3881 164.9239 167.6801 170.8466 175.4364 203.5564 217.2009 227.4644 229.5134 233.2141 239.9753 256.5885 264.0661 271.2595 274.1253 282.4399 289.5918 298.3671 306.0721 321.5868 333.9940 334.1864 355.1148 363.7705 372.9993 379.6924 413.8672 422.7325 423.5179 449.5129 460.5016 472.7876 502.2771 520.2915 529.5810 535.3407 539.5046 557.0592 562.8149 571.7519 573.2297 598.2625 611.8353 627.7702 634.6162 638.2739 651.0931 662.5361 668.9519 683.4459 713.3015 720.2815 729.9278 736.2419 742.7689 767.5105 771.5283 792.0607 795.7260 814.3528 818.9952 821.0962 823.4743 827.2777 836.2810 864.7239 898.7245 903.5094 908.4240 910.3810 944.3073 945.2026 949.7263 949.9503 954.6372 987.0995 1000.7054 1005.1658 1016.5000 1018.3048 1022.8610 1027.4694 1027.9834 1030.4593 1036.0900 1040.7825 1050.0469 1051.9893 1052.4480 1056.0083 1059.6334 1073.5613 1075.8801 1079.4414 1096.2231 1097.2339 1113.3175 1114.0186 1117.7149 1127.6254 1132.0323 1158.4597 1164.9420 1167.5129 1172.8061 1175.3740 1179.1203 1190.1942 1193.1306 1226.9532 1271.6364 1294.1325 1302.4130 1313.8345 1321.9146 1341.5660 1343.9853 1347.7576 1358.9998 1364.6080 1366.9104 1382.8030 1394.6702 1395.2043 1397.6677 1399.6367 1408.8869 1410.0298 1413.4172 1423.7271 1446.2735 1448.8599 1451.9425 1455.1811 1458.3375 1460.0713 1463.6211 1466.3083 1471.0125 1474.4672 1475.7910 1478.8297 1481.7079 1487.0646 1515.6145 1518.0076 1524.3129 1567.8971 1598.6846 1627.2932 1639.8003 1640.0597 1647.8980 1660.4558 1662.2587 1668.4773 1765.8092 3007.1465 3008.4985 3010.8040 3012.2796 3015.9336 3059.4275 3075.3456 3078.1423 3087.6081 3089.1533 3112.1446 3115.9240 3119.7807 3122.2035 3131.9905 3143.6629 3173.1121 3173.5108 3181.0227 3186.8159 3193.5872 3195.2893 3197.1976 3197.6475 3201.1286 3206.9010 3214.6695 3215.3450 3216.6221 3217.9234 3234.3705 3285.7402 3303.7540
redmass: 5.5595 3.6604 5.9443 5.9358 5.5009 5.9333 4.6989 4.5603 3.2490 2.5938 1.5158 4.7958 4.0607 4.3976 1.4554 1.9103 3.1231 1.3891 2.5382 2.1899 3.1204 2.8174 3.2252 2.6005 4.2930 3.0811 2.2101 1.6990 4.2377 4.1777 2.5510 2.1874 4.4691 2.1062 2.7663 4.4142 5.6214 2.7732 7.0494 4.3782 6.1175 3.7509 5.2501 4.5490 3.0096 5.2879 3.4652 3.9614 4.2571 3.8132 4.0969 7.2155 3.5440 4.1760 3.5467 4.2937 4.3875 3.1416 7.4287 3.9777 4.9454 6.3423 5.0864 4.1428 6.6410 3.5393 6.5117 3.9018 1.7064 6.2148 3.5814 1.5560 1.2784 2.1345 1.8217 2.0635 2.3987 3.8074 2.9607 1.3155 2.9676 1.2486 1.2564 6.2740 1.4979 1.6740 1.4024 4.6789 1.4343 1.4757 1.5675 1.4731 1.3695 1.3830 1.4313 3.4671 1.4656 1.3947 1.3736 1.3560 1.3256 2.0596 1.5235 1.5048 2.3854 2.1096 1.6297 6.0868 2.3319 1.9405 1.8817 2.2707 1.5636 2.0527 1.8562 2.2459 1.7334 1.6559 1.4564 1.1520 1.0990 2.3016 1.7886 3.2884 1.1365 1.3565 1.8127 1.8959 3.3931 2.1607 1.6924 1.5462 3.8104 2.9600 5.1839 2.6163 2.0003 4.2403 1.5186 1.3203 3.8950 1.2947 5.0075 1.5045 2.1874 1.2292 2.6946 1.0530 1.0744 1.0654 1.0634 1.0673 1.3919 1.0772 1.0758 1.1322 1.2126 2.0033 2.1808 1.3055 2.3457 2.9172 2.9755 2.3851 6.2118 7.0249 6.9545 6.2430 7.0933 6.7206 6.0446 6.3156 6.7061 12.3231 1.0407 1.0463 1.0457 1.0474 1.0458 1.1001 1.0933 1.0912 1.0911 1.0921 1.0569 1.1011 1.1016 1.1025 1.1015 1.0981 1.0860 1.0869 1.0900 1.0923 1.0929 1.0537 1.0954 1.0910 1.0983 1.1162 1.0888 1.0954 1.0927 1.0931 1.0976 1.0941 1.1156
irintensity: 71.2777 0.0871 0.0169 0.2164 0.3479 1.8190 0.4176 0.2050 0.6024 0.9101 0.8069 0.7755 0.2835 0.3469 1.8368 0.3789 0.2606 0.3007 0.0509 0.4840 0.3753 0.6190 0.0640 2.6156 1.7274 1.1035 8.3741 8.2112 7.2329 3.5340 2.4275 2.8490 0.3349 1.2430 4.4532 5.4732 3.8287 4.4446 2.7661 7.7560 2.9117 4.2981 13.2047 9.6351 0.1802 0.4018 0.0443 3.1172 1.3969 28.8298 1.4923 1.9383 2.4429 1.5459 0.8453 26.1618 3.7460 0.9755 3.3376 3.5456 16.2048 0.0708 147.6098 3.7646 11.7385 3.6078 0.7374 6.3601 52.1526 0.4085 10.3658 19.1402 13.3298 4.2861 44.2055 17.1170 2.0655 4.5574 1.5354 11.9763 2.9685 6.2335 0.9819 7.3615 3.1401 1.5444 4.9640 9.2925 8.3354 10.5420 3.4029 1.1952 0.9960 0.5887 1.1214 0.8600 2.6504 6.9005 0.1508 0.0099 0.9086 3.3851 2.0289 1.1861 22.2525 0.6978 0.8191 8.9241 4.7980 13.1366 2.1302 15.3671 13.8567 1.9195 0.3727 5.4545 4.4342 6.8615 50.7741 4.9562 0.2246 10.8124 26.9630 8.0371 4.4772 1.5315 2.0055 2.6281 11.6174 22.5820 25.3760 11.1041 31.8593 31.7251 104.0741 78.0644 7.5611 10.3239 0.5102 1.3853 28.4893 1.5025 107.3811 0.9467 1.2085 1.6281 2.0723 5.4064 4.7234 0.8692 0.9385 12.1664 3.8336 5.3688 0.2586 8.8884 5.7101 44.7309 9.7729 7.2410 25.4738 121.8377 231.0470 12.5716 2.2260 325.5800 27.9120 0.8356 16.3309 168.5140 6.9059 91.4811 119.1242 320.4563 39.2015 23.5716 50.9885 45.0228 61.7733 16.0782 11.8085 7.6681 13.7576 4.8141 15.2867 8.3190 23.4082 6.4620 10.2378 12.3673 2.3649 2.9640 7.4041 10.1406 20.2883 4.8995 17.7177 3.5882 9.6886 5.4925 4.6363 7.7164 2.9661 0.5949 1.3722 19.1036 4.6288
temp: 298.150 k
press: 1.00000 atm
elementType: 1 6 6 7 6 6 6 6 6 6 6 8 1 1 1 1 6 6 7 6 6 6 1 1 1 1 6 6 6 6 6 6 1 1 1 1 1 6 6 6 1 1 1 1 8 45 6 6 6 6 6 6 1 1 1 6 1 1 1 6 1 1 1 6 1 1 1 6 1 1 1
symmnumber: 1
zpe: 1514179.8 jmol-1
zpe.correction: 0.576721 hartree
zpe.thermalcorrener: 0.611925 hartree
zpe.thermalcorrenthalpy: 0.612869 hartree
zpe.thermalcorrgfe: 0.510356 hartree
zpe.sumelectzpe: -1646.422932 hartree
zpe.sumelectthermal: -1646.387728 hartree
zpe.sumelectthermalent: -1646.386784 hartree
zpe.sumelectthermalfe: -1646.489297 hartree
dipole: 2.3539 0.7268 0.4191
dipole: 2.4990
quadrupole: -231.1954 -210.6060 -251.0907
quadrupole: 7.4245 2.3914 3.6252
quadrupole: -0.2314 20.3581 -20.1267 7.4245 2.3914 3.6252
hfenergy: -1646.9996531 hartree
pointgroup: C01 [X(C33H33N2O2Rh1)]
dipole: 0.9261048 0.2859401 0.1649027 debye
polarizability: 581.0500106|24.0288265|444.3340158|19.0531578|10.1789313|294.5902275 unknown
InChI: InChI=1S/C14H9N2O.C10H15.C9H9O.Rh/c17-14-12-6-2-1-5-11(12)8-10-16(14)13-7-3-4-9-15-13;1-6-7(2)9(4)10(5)8(6)3;10-9(6-7-9)8-4-2-1-3-5-8;/h1-9H;1-5H3;1-5H,6-7H2;/q-1;;-1;+2
charge 0 multiplicity 1
71 atoms
H  -1.65926485 -2.27628501 -0.81464113
C  -2.23811723 -1.37326207 -0.62997885
C  -1.6078625 -0.19655155 -0.36926588
N  -2.39806044 0.97316909 -0.17476795
C  -3.82200519 0.94945369 -0.07723551
C  -4.45133423 -0.34663164 -0.34601679
C  -3.66914017 -1.48706578 -0.64157835
C  -4.33336683 -2.706693 -0.90707391
C  -5.71819109 -2.7770852 -0.87632827
C  -6.48924478 -1.63647776 -0.57865313
C  -5.85597279 -0.43094899 -0.3146164
O  -4.45716311 1.95590214 0.19880081
H  -6.4195142 0.47349615 -0.08091526
H  -7.57902467 -1.70276487 -0.55664505
H  -6.21580878 -3.72781382 -1.08418422
H  -3.73879422 -3.59501625 -1.13412595
C  -1.6848026 2.17674462 -0.13032466
C  -2.22373003 3.47395463 -0.18961773
N  -0.34340034 2.0008139 -0.09117001
C  -1.35348902 4.55592075 -0.26801936
C  0.49247228 3.04649632 -0.20221051
C  0.02951944 4.34939768 -0.29242353
H  -3.30082029 3.59625856 -0.17889392
H  -1.76334558 5.56665127 -0.32471467
H  1.55400743 2.80238251 -0.20620008
H  0.73646557 5.17540885 -0.37395484
C  3.11209172 -0.46185467 -1.78449633
C  4.10171781 -1.45091654 -1.66127843
C  3.50188252 0.88433835 -1.72516987
C  5.44042338 -1.10100035 -1.47382022
C  4.83901427 1.2350853 -1.53278538
C  5.8158155 0.24378423 -1.40539798
H  3.83545426 -2.5082876 -1.70702563
H  2.7313643 1.644012 -1.85748351
H  6.19474448 -1.88578012 -1.37852464
H  5.12251987 2.2898301 -1.49145748
H  6.86319343 0.51598338 -1.25630227
C  1.65199697 -0.76652064 -2.01856656
C  1.25581329 -2.12318624 -2.46272031
C  1.12193148 -2.06233066 -0.95909038
H  2.02652409 -2.78122471 -2.87537259
H  0.3094548 -2.1452119 -3.00952167
H  0.12931095 -2.257019 -0.5610273
H  1.93056883 -2.46141292 -0.35336679
O  0.83050182 0.25178745 -2.13709733
Rh 0.31053533 0.11396868 -0.10666841
C  1.48044544 0.54254036 2.11842513
C  0.23055539 -0.22977978 2.05408699
C  0.64532838 -1.65217451 2.12191461
C  2.02162139 -1.71257789 2.07356399
C  2.54302367 -0.35043697 2.02272632
C  2.90265443 -2.92473323 2.03466089
H  2.32302943 -3.85460317 1.94191598
H  3.61491112 -2.88550486 1.19223166
H  3.51555607 -3.01013121 2.94991065
C  -0.32199448 -2.78880156 2.19262416
H  -0.75430019 -2.88636604 3.20515012
H  -1.17183082 -2.63848492 1.50897114
H  0.1502276 -3.75132837 1.94543729
C  -1.02865415 0.22061407 2.76037099
H  -1.28001183 1.26789509 2.53656926
H  -1.89375797 -0.39245211 2.46761882
H  -0.92069539 0.13827098 3.85707832
C  1.58638535 1.98573554 2.51698595
H  0.65505422 2.5387869 2.34375578
H  1.80219161 2.06311598 3.59804498
H  2.39785221 2.51694031 1.99536783
C  3.99944365 -0.02048809 1.95871927
H  4.47919452 -0.49518351 1.08834881
H  4.17429539 1.06153371 1.88135219
H  4.53304904 -0.38567809 2.85464409
