program: Gaussian 16
title: CuOAc included
version: ES64L-G16RevA.03
method: RB3LYP
basis: def2SVP
operation: Freq
keyword: #N
keyword: Geom=AllCheck
keyword: Guess=TCheck
keyword: SCRF=Check
keyword: GenChk
keyword: RB3LYP/def2SVP
keyword: Freq
converged: YES YES NO YES
title: Mulliken charges:
elementType: C C N C C C C C C C H O H H H H C C N C C C H H H H C C C H C C H C H H C H H H C H C C H H H H H H Ru O C O C H H H C C C C C C H H H H H C C C H H H H O H Cu O C O C H H H O C O C H H H
charge: -0.011012 0.130432 -0.214534 0.210270 -0.065737 0.137186 -0.007014 0.050318 0.069557 0.001525 0.121847 -0.176109 0.028253 0.028885 0.009195 0.036908 0.220354 0.011748 -0.235721 0.087931 0.134213 0.009875 0.036925 0.041974 0.071078 0.040726 0.033647 0.081531 0.030249 0.046271 -0.072006 0.076927 0.043878 0.092811 0.038918 0.029037 0.102123 0.067525 0.019270 0.048768 -0.048405 0.007548 0.057740 0.014889 0.037792 0.015588 0.033883 0.012868 0.038504 0.015991 -0.111509 -0.334591 0.211779 -0.385809 0.043239 0.049179 0.047404 0.045377 0.063316 -0.030025 -0.022656 0.010362 0.018573 0.014091 -0.044420 0.000577 -0.013030 0.004585 -0.007734 0.023699 -0.048322 0.027141 0.028849 0.026750 0.034074 0.042278 -0.293013 0.186835 0.364837 -0.353692 0.189112 -0.366377 0.064165 0.041879 0.049073 0.037274 -0.247156 0.275650 -0.440288 0.063568 0.062022 0.050522 0.027991
chargesum: 1.00000
title: Mulliken charges with hydrogens summed into heavy atoms:
elementType: C C N C C C C C C C O C C N C C C C C C C C C C C C C Ru O C O C C C C C C C C C C O Cu O C O C O C O C
charge: -0.011012 0.252279 -0.214534 0.210270 -0.065737 0.137186 0.029894 0.059513 0.098442 0.029779 -0.176109 0.220354 0.048673 -0.235721 0.129904 0.205292 0.050601 0.062684 0.127801 0.030249 -0.072006 0.120805 0.131729 0.237686 -0.040858 0.125103 0.102152 -0.111509 -0.334591 0.211779 -0.385809 0.185200 0.063316 -0.074445 -0.022080 -0.002668 0.023158 0.006356 0.023699 0.007278 0.103492 -0.106179 0.364837 -0.353692 0.189112 -0.366377 0.192392 -0.247156 0.275650 -0.440288 0.204103
1716.lowfreq: -5.1138 -3.0845 -0.6134 -0.0029 -0.0002 0.0026 20.8504 22.3567 24.9642
redmass: 6.0553 5.1548 6.2001 5.8779 5.0524 4.1144 4.6052 4.5242 2.5970 5.4461 1.3752 2.1685 4.8479 2.0217 2.3714 4.2825 3.9028 3.4341 4.0302 2.9509 2.7643 5.2299 6.4205 3.4428 4.5986 3.6364 5.7702 5.4467 4.5447 3.6091 4.7545 4.8750 7.5048 5.2727 4.3051 3.4792 6.6323 6.6870 5.0939 3.7971 6.1194 3.6640 4.2841 1.0880 1.4536 2.7597 7.9150 1.1578 5.2505 5.1657 6.5433 3.6363 3.8255 5.7146 5.8979 5.1555 3.9528 5.0559 5.6364 5.6416 3.8783 5.9908 3.4175 3.4198 2.8913 6.2467 3.0518 3.6594 3.6651 4.1573 4.0250 4.5864 3.4460 6.2265 3.9731 4.8723 3.1481 3.7553 3.5807 3.0162 4.4904 5.1932 2.5559 2.6595 2.8149 6.3280 8.1568 6.9661 6.5516 5.8601 5.5734 5.6313 6.1115 3.6637 3.3362 3.7452 5.1336 5.9340 1.6513 6.0722 1.1511 4.2017 2.9873 1.0991 1.7267 1.6483 1.8577 4.2475 2.3975 1.2823 2.1090 1.6191 3.3030 2.3025 1.5962 1.3656 1.3594 3.5726 1.4832 1.2289 1.8198 1.5299 6.1528 1.8556 6.0942 1.8414 2.2267 1.4612 1.7001 1.4261 1.4788 1.3827 1.4964 1.3683 4.3476 1.6597 1.5231 1.4289 1.8960 1.4539 1.3817 1.8378 1.8266 1.5106 1.9289 5.5387 1.9394 2.2467 3.0127 1.4712 1.4463 1.9061 1.6299 2.2553 1.5456 1.8604 2.1511 2.3575 1.8131 1.6683 1.5767 1.9615 1.0837 1.0958 1.2605 1.1591 1.1091 1.1276 2.7739 2.0635 4.0336 2.1603 2.1251 2.9152 2.5267 1.4943 2.8939 1.4806 2.1239 1.6426 2.2648 2.4615 3.1891 2.2559 1.3724 1.6497 5.3258 1.2973 1.2597 5.8473 2.3756 1.3018 1.2458 1.3911 1.4342 1.3404 2.5754 2.8188 1.1946 1.1324 1.1994 1.1253 1.0842 1.1175 1.2538 1.5658 1.1036 1.2064 1.9673 1.0573 1.6305 1.4622 2.3858 1.1896 1.8254 2.5045 2.4797 2.9679 2.5392 4.1422 5.3893 5.7685 6.5452 9.0819 6.0243 5.9819 6.3391 6.0333 10.6687 12.3911 12.8351 1.0380 1.0367 1.0390 1.0391 1.0379 1.0412 1.0881 1.0905 1.1004 1.1026 1.0535 1.0966 1.0986 1.0571 1.0973 1.1036 1.1029 1.0965 1.1062 1.1080 1.0868 1.1083 1.0900 1.0947 1.1057 1.0898 1.0937 1.0929 1.0961 1.0917 1.0944 1.0942 1.0928 1.0936 1.1164 1.0987 1.0989 1.0952 1.1192 1.0935 1.0954 1.0671
irintensity: 0.0816 0.0498 1.2208 0.8727 0.2363 0.1216 1.0963 1.0298 0.8840 1.6767 0.5565 0.5620 0.2650 1.3642 0.4115 0.6282 0.3797 0.3738 2.6336 0.5212 0.6806 0.4427 1.1500 0.8811 5.9808 0.9693 1.9369 2.5295 2.8728 0.2522 1.1885 5.9964 10.5210 3.8320 2.6213 1.4312 6.5776 3.2743 3.4329 1.1837 1.9074 0.6228 1.5300 1.3458 2.3445 19.5198 10.2807 0.7298 1.4380 3.9613 4.8740 6.1847 2.3484 12.6572 9.8662 11.8218 2.2901 7.7594 11.8245 7.1187 2.5374 2.0381 1.9731 7.4080 0.1387 6.7358 1.3270 4.7855 2.4291 3.8812 2.1125 1.0681 3.7467 0.5571 10.6363 1.1813 2.8972 9.9657 3.8484 15.5000 2.3765 0.7864 5.0883 0.7811 10.3964 0.4392 20.1150 13.5017 8.7090 8.3488 8.8541 69.3186 67.3610 1.6616 4.6764 16.9987 4.5081 40.9951 49.3875 4.6411 111.1052 4.5204 6.0203 10.7098 42.6426 42.2112 28.3133 3.2114 1.0013 0.2146 9.7104 10.2890 4.1678 6.0732 7.4423 17.8469 8.8737 24.2642 6.4525 4.4966 27.2012 0.1959 36.5351 2.1968 9.1997 1.1708 2.3478 0.5328 4.8285 0.9102 2.7581 0.3256 7.0752 1.7646 1.3560 11.6323 30.6355 0.0533 0.9792 4.4133 2.2891 22.4040 7.1766 15.8296 2.2084 14.8843 4.0350 4.2267 13.5567 1.8206 1.8239 1.1763 27.7446 28.7181 3.3396 16.6411 16.4073 6.4577 0.5793 0.9687 29.2464 0.3755 0.0539 3.5415 0.7937 6.7169 1.6523 0.3172 2.2788 0.8893 422.2220 33.3110 51.9395 54.6025 229.1262 0.6931 19.4127 6.2422 81.8085 36.0154 229.0887 56.5759 23.3160 259.4923 3.9554 10.1789 5.9812 47.8223 4.4494 39.9720 489.5024 2.0040 4.2841 40.9691 104.3803 11.7259 120.6476 3.6735 21.2200 15.0543 71.6432 53.3693 10.4973 64.3164 106.8462 133.0846 4.8433 2.5366 7.3703 10.8838 13.7980 7.7234 21.4963 3.9010 12.0741 88.6937 34.7388 5.6262 12.5147 24.8785 9.0160 3.0990 0.9590 84.2112 1.1573 156.2749 35.5139 8.3099 542.3086 167.8078 321.0158 5.3424 16.6524 13.4194 0.4075 0.1839 0.1012 10.6492 10.5149 2.6925 1.2239 12.5330 7.7798 1.7797 2.4838 2.2921 7.8030 18.8263 0.0800 1.7163 1.5247 1.4714 3.0327 5.0952 8.5129 1.1551 0.7845 4.2918 8.7787 1.1171 2.3852 7.5717 1.4443 0.3232 1.1789 1.9425 4.6698 1.0500 13.6477 3.1978 78.5338 11.3914 941.3341
temp: 298.150 k
press: 1.00000 atm
elementType: 6 6 7 6 6 6 6 6 6 6 1 8 1 1 1 1 6 6 7 6 6 6 1 1 1 1 6 6 6 1 6 6 1 6 1 1 6 1 1 1 6 1 6 6 1 1 1 1 1 1 44 8 6 8 6 1 1 1 6 6 6 6 6 6 1 1 1 1 1 6 6 6 1 1 1 1 8 1 29 8 6 8 6 1 1 1 8 6 8 6 1 1 1
symmnumber: 1
zpe: 1943468.6 jmol-1
zpe.correction: 0.740228 hartree
zpe.thermalcorrener: 0.791965 hartree
zpe.thermalcorrenthalpy: 0.792909 hartree
zpe.thermalcorrgfe: 0.652722 hartree
zpe.sumelectzpe: -3955.819311 hartree
zpe.sumelectthermal: -3955.767574 hartree
zpe.sumelectthermalent: -3955.766630 hartree
zpe.sumelectthermalfe: -3955.906817 hartree
dipole: -6.1301 1.6317 -4.2338
dipole: 7.6266
quadrupole: -238.2767 -260.4566 -298.8897
quadrupole: -10.9598 13.9535 -1.0161
quadrupole: 27.5976 5.4177 -33.0153 -10.9598 13.9535 -1.0161
hfenergy: -3956.5595391 hartree
pointgroup: C01 [X(C39H42Cu1N2O8Ru1)]
dipole: -2.3576955 0.9062246 -1.6196495 debye
polarizability: 708.8480857|-26.2855594|598.4236934|32.4898436|19.7236221|397.0125986 unknown
InChI: InChI=1S/C14H9N2O.C10H14.C9H10O.3C2H3O2.Cu.Ru/c17-14-12-6-2-1-5-11(12)8-10-16(14)13-7-3-4-9-15-13;1-8(2)10-6-4-9(3)5-7-10;10-9(6-7-9)8-4-2-1-3-5-8;3*1-2(3)4;;/h1-7,9-10H;4-8H,1-3H3;1-5,10H,6-7H2;3*1H3;;/q-1;;;;2*-1;+2;+1
charge 1 multiplicity 1
93 atoms
C  -0.67466079 1.01108011 -0.01019997
C  -2.07701004 1.14370515 -0.3215114
N  -2.75978487 2.37044143 -0.19987894
C  -2.11229757 3.5781706 0.14998946
C  -0.65005724 3.4697293 0.36292387
C  0.04582585 2.22790125 0.28262147
C  1.4390932 2.22744732 0.53105331
C  2.10672392 3.40657022 0.84538689
C  1.40601726 4.6157447 0.92655841
C  0.02914918 4.64482373 0.68806646
H  -2.39462109 0.56240077 -1.2012579
O  -2.73100061 4.61413863 0.25588968
H  -0.53948599 5.57319203 0.75659413
H  1.93083877 5.53819944 1.18419437
H  3.17896014 3.37400812 1.04522539
H  1.99553887 1.29369611 0.49815095
C  -4.15994538 2.27521733 -0.2710259
C  -5.02662102 3.29769245 -0.66671868
N  -4.62915748 1.05784688 0.08735665
C  -6.3955811 3.03300771 -0.65757508
C  -5.94447846 0.79307711 0.06852923
C  -6.86761932 1.77096279 -0.28344474
H  -4.62907315 4.26380479 -0.96434253
H  -7.09501485 3.8171589 -0.95488165
H  -6.22236102 -0.22264232 0.35845838
H  -7.93424185 1.54501795 -0.25933668
C  0.64356214 -2.87969039 -1.00253203
C  -0.33987115 -2.16508789 -1.76612163
C  1.88245528 -2.30120319 -0.70076665
H  -1.33463467 -2.59092314 -1.91175505
C  -0.06141709 -0.90510915 -2.33991339
C  2.09861004 -0.9435058 -1.12632514
H  3.01554415 -0.438734 -0.83731889
C  1.17240361 -0.28220329 -1.9545337
H  1.40074392 0.73084121 -2.2881218
H  0.38416935 -3.86415766 -0.61218654
C  -1.03099589 -0.23768988 -3.26976377
H  -2.05415153 -0.59676548 -3.09061881
H  -0.99268409 0.8577631 -3.17896293
H  -0.76383962 -0.48901026 -4.30972829
C  2.97389037 -3.02844822 0.05377117
H  3.67930123 -2.26351176 0.40355275
C  3.71888617 -3.9430197 -0.93610879
C  2.46893221 -3.80784767 1.27008055
H  1.92614124 -3.15613077 1.96888413
H  1.80153482 -4.63709468 0.98546816
H  3.32007373 -4.24750972 1.81017529
H  3.06375404 -4.74828208 -1.30588352
H  4.58368953 -4.40604268 -0.43748532
H  4.0892778 -3.37615683 -1.8021307
Ru 0.11305303 -0.78170783 -0.06984546
O  2.87927221 -0.31049814 1.66415618
C  1.87285038 -0.44861746 2.36040435
O  0.67139549 -0.56852914 1.87981471
C  1.94694482 -0.52021777 3.86844312
H  1.04020248 -0.10883669 4.3307866
H  2.02900493 -1.57931128 4.16389471
H  2.84202342 0.00298323 4.22834644
C  5.3321851 0.50602537 -0.77702622
C  4.66838148 1.55186485 -1.4337712
C  5.56264384 -0.68653145 -1.48604322
C  4.25051387 1.41641723 -2.76307037
C  5.14944959 -0.82327244 -2.81136576
C  4.48727843 0.22796554 -3.45719303
H  4.47203122 2.48601732 -0.90641538
H  6.06975061 -1.50663366 -0.97477492
H  3.74418101 2.24930388 -3.2582182
H  5.35287657 -1.75163463 -3.35093992
H  4.17036094 0.12304092 -4.49734218
C  5.79995677 0.58782114 0.65019499
C  5.82435811 1.89914527 1.39884287
C  7.11571141 1.25843105 0.9475876
H  5.57382249 1.84365313 2.4606732
H  5.51343883 2.8217235 0.90219212
H  7.65811085 1.71992745 0.11889011
H  7.73380698 0.76653094 1.70236174
O  5.55805118 -0.56517855 1.39835508
H  4.61645477 -0.53241458 1.66186088
Cu -3.29490809 -0.32237423 0.43873087
O  -3.45766554 -1.69233817 -1.60146614
C  -4.26791464 -2.28493892 -0.86084566
O  -4.53879243 -1.84902269 0.32221032
C  -4.94900135 -3.56193327 -1.28725985
H  -5.97302329 -3.61164964 -0.89293344
H  -4.39246963 -4.41377673 -0.86319603
H  -4.94735491 -3.64819544 -2.38142004
O  -2.71142955 -0.86970013 2.79285903
C  -1.88308006 -1.53986481 2.21003917
O  -1.7186181 -1.3524654 0.88706898
C  -1.12031856 -2.67314843 2.83295167
H  -1.83548642 -3.49454309 3.00122299
H  -0.73210336 -2.35911413 3.81021975
H  -0.30481884 -3.02863668 2.19624529
