program: Gaussian 16
title: Transition State
version: ES64L-G16RevA.03
method: RB3LYP
basis: def2SVP
operation: Freq
keyword: #N
keyword: Geom=AllCheck
keyword: Guess=TCheck
keyword: SCRF=Check
keyword: GenChk
keyword: RB3LYP/def2SVP
keyword: Freq
converged: YES YES NO YES
title: Mulliken charges:
elementType: C C N C C C C C C C H O H H H H C C N C C C H H H H C C C H C C H C H H C H H H C H C C H H H H H H Ru O C O C H H H
charge: -0.045415 0.089194 -0.201071 0.171715 -0.083145 0.136522 -0.026964 0.035676 0.028224 -0.004484 0.032916 -0.258250 -0.011556 -0.022111 -0.025774 0.011578 0.086089 0.023974 -0.116188 0.056998 0.040922 -0.007265 0.009608 -0.003897 -0.003964 -0.009033 0.023038 0.084021 0.027064 0.020261 -0.028724 0.049912 0.006510 -0.000160 0.008433 0.019238 0.136607 0.042503 0.025378 0.019942 -0.046973 -0.007563 0.062377 0.020345 0.061019 0.006861 0.005988 0.007230 0.013937 0.008963 -0.303914 -0.320641 0.273101 -0.316040 0.079334 0.053316 0.031258 0.033079
chargesum: -0.00000
title: Mulliken charges with hydrogens summed into heavy atoms:
elementType: C C N C C C C C C C O C C N C C C C C C C C C C C C C Ru O C O C
charge: -0.045415 0.122110 -0.201071 0.171715 -0.083145 0.136522 -0.015386 0.009902 0.006114 -0.016040 -0.258250 0.086089 0.033582 -0.116188 0.053101 0.036958 -0.016299 0.042276 0.104283 0.027064 -0.028724 0.056423 0.008273 0.224430 -0.054536 0.092506 0.094213 -0.303914 -0.320641 0.273101 -0.316040 0.196988
chargesum: 0.00000
1716.lowfreq: -0.0007 -0.0004 0.0004 1.7129 3.3679 4.9263 14.2257 17.5959 30.1635
frequency: 14.2206 17.5843 30.1581 42.3150 44.4785 50.9837 64.4651 67.1360 75.8748 96.6467 108.1186 129.8966 132.5408 156.4192 164.4158 168.0067 177.5939 180.1517 196.1466 204.2519 209.4917 245.1754 247.2508 266.8037 271.6210 290.2899 290.9103 309.0379 311.0289 326.1830 348.5647 364.1247 383.6311 397.5755 416.3062 418.3367 427.5394 443.5144 445.5773 466.8187 476.6407 493.3386 503.8945 533.6603 553.8017 574.8870 582.2724 617.0290 621.5768 632.1616 644.0864 647.0102 664.0357 683.1120 693.9685 700.6422 717.4916 751.8236 760.3232 764.2523 793.3038 810.8952 821.6729 829.7458 871.9563 880.1807 892.5303 897.1391 906.0681 908.1060 909.8436 931.7289 939.2096 956.6024 967.1296 967.1780 980.8117 984.7572 995.7865 1000.7767 1011.3546 1014.3251 1017.7805 1022.9859 1028.4467 1045.4661 1050.7640 1057.4621 1063.7509 1072.0742 1100.3079 1104.3236 1114.8668 1128.6912 1143.1805 1163.2074 1164.8281 1166.2396 1169.1464 1197.7197 1228.7316 1237.1010 1245.2493 1278.2497 1291.6398 1299.2881 1313.2326 1325.9473 1345.7341 1346.7967 1352.4111 1362.7320 1375.0848 1387.4075 1394.9513 1396.6141 1402.8385 1412.1083 1427.8661 1434.1439 1443.2672 1457.5240 1462.6045 1463.4497 1465.4645 1470.3109 1476.3101 1477.3352 1489.0340 1499.9334 1503.9280 1509.1129 1531.6131 1547.5731 1581.1143 1587.1299 1600.4666 1633.5776 1640.0024 1657.4751 1663.5701 1751.8859 3025.6511 3034.4869 3037.3738 3037.4336 3049.3123 3105.5937 3110.7081 3116.6024 3121.0944 3134.0473 3143.4797 3148.6944 3154.3500 3169.1407 3172.3064 3186.3917 3189.9525 3191.2592 3203.7341 3204.0459 3206.2481 3212.8714 3214.1853 3224.7895 3251.0717 3274.2033
redmass: 4.2045 5.0366 5.0299 2.7643 4.6292 5.8656 4.2754 4.4991 1.0304 4.6031 4.7555 4.1336 5.4318 4.3263 1.2407 3.4849 4.1569 5.0569 3.7152 4.0077 5.1144 1.1434 4.7514 3.3708 1.2121 4.2675 6.9071 4.2146 5.0420 5.1569 2.8172 6.6039 6.4030 4.1381 6.4737 4.1859 3.6608 3.2954 3.1580 4.2277 3.9812 4.5363 7.6322 3.0846 3.5622 5.6012 4.0086 2.8619 3.2668 7.6969 7.2660 7.0631 6.4254 4.2430 3.4491 5.0954 3.2276 6.1992 2.7709 2.5226 1.5930 2.6676 4.6143 3.0961 1.4048 1.4556 2.8119 1.3940 1.4012 2.2265 1.7315 1.1666 1.2446 1.3510 5.0869 1.4587 6.5311 1.4310 1.4558 1.3815 1.5016 6.3989 2.5459 1.3383 1.3530 1.5039 1.8589 2.3890 1.5683 2.2785 2.4640 1.5352 1.5389 2.0666 1.6361 1.3034 1.6660 1.1117 1.2520 2.4262 2.8687 1.7407 2.4443 2.0806 1.4870 2.1627 2.9256 1.3938 1.8041 2.2234 4.3323 1.2886 3.7148 1.2983 1.6004 2.8722 1.2994 1.2983 1.0863 2.2558 1.0720 1.3491 1.0427 1.1946 1.1421 2.6134 1.0739 2.5814 1.0960 2.4130 2.5153 2.9303 8.6198 4.1496 5.5788 6.7875 6.1901 6.6830 6.7880 6.4458 6.6655 12.2912 1.0360 1.0519 1.0442 1.0677 1.0376 1.1034 1.1022 1.1043 1.0966 1.0991 1.1039 1.0911 1.1047 1.1076 1.0878 1.0905 1.0934 1.0902 1.0908 1.0930 1.0979 1.0945 1.0956 1.0928 1.0916 1.0947
irintensity: 0.0155 0.3460 0.1078 0.0687 0.2790 3.3412 1.7203 0.5980 0.3285 3.1884 0.5846 0.7965 1.3755 1.3064 0.2109 1.3980 1.3195 0.0606 2.2905 4.4005 4.4113 1.0599 1.2389 3.0299 0.1814 4.4708 4.2582 12.8366 4.3972 3.5689 0.8238 7.2796 4.8070 2.1239 0.2118 6.0858 4.3592 2.5501 0.8934 1.5200 1.2115 0.3536 0.9173 1.2019 2.3970 5.8260 1.4641 6.0642 1.0899 8.5658 0.4203 2.8994 8.2016 4.5209 12.2372 61.6528 18.6492 4.2372 17.0577 18.4443 25.5319 22.7732 7.8365 5.1097 24.8017 8.7054 1.0434 0.4144 2.2065 1.5016 2.6482 1.3921 0.5059 0.3547 26.1381 0.6711 22.5873 1.2416 0.0840 0.9982 3.0245 6.9407 2.4629 0.7566 0.0179 12.5792 10.7982 23.7259 16.1354 2.3737 23.1120 4.4906 0.4265 1.3616 7.3643 1.7642 1.2611 6.4512 0.5349 9.6651 5.0649 0.6204 12.8303 28.8454 9.3323 127.7057 133.6483 3.3008 11.0581 5.0354 58.3680 1.4409 20.1903 3.0894 4.0413 49.5004 1.7803 8.3943 25.2017 7.5031 15.6955 12.0255 1.9014 2.5071 4.2196 169.6483 3.8491 8.9124 2.1469 9.1524 95.3116 80.3617 327.5147 4.4879 17.6709 79.6254 57.4535 16.3553 157.4739 73.7837 25.4578 480.4208 22.9052 16.7584 17.8475 18.6355 1.1067 1.1496 53.0029 20.7029 4.3278 3.7595 2.3158 26.8121 2.8894 2.2826 7.2502 8.1188 21.2030 3.8239 0.5671 2.8708 15.0358 6.2965 0.7246 3.6406 12.0884 3.6064
temp: 298.150 k
press: 1.00000 atm
elementType: 6 6 7 6 6 6 6 6 6 6 1 8 1 1 1 1 6 6 7 6 6 6 1 1 1 1 6 6 6 1 6 6 1 6 1 1 6 1 1 1 6 1 6 6 1 1 1 1 1 1 44 8 6 8 6 1 1 1
symmnumber: 1
zpe: 1222520.0 jmol-1
zpe.correction: 0.465633 hartree
zpe.thermalcorrener: 0.495454 hartree
zpe.thermalcorrenthalpy: 0.496398 hartree
zpe.thermalcorrgfe: 0.403194 hartree
zpe.sumelectzpe: -1435.324589 hartree
zpe.sumelectthermal: -1435.294768 hartree
zpe.sumelectthermalent: -1435.293824 hartree
zpe.sumelectthermalfe: -1435.387028 hartree
dipole: 4.9767 -1.9750 -0.8217
dipole: 5.4169
quadrupole: -196.0448 -189.3942 -193.8715
quadrupole: 9.7561 -4.8508 -0.8388
quadrupole: -2.9413 3.7093 -0.7680 9.7561 -4.8508 -0.8388
hfenergy: -1435.7902221 hartree
pointgroup: C01 [X(C26H26N2O3Ru1)]
dipole: 1.9659251 -0.765659 -0.301399 debye
polarizability: 397.1462703|4.6269876|387.9679865|-13.3901534|1.5968173|242.7833704 unknown
InChI: InChI=1S/C14H9N2O.C10H14.C2H3O2.Ru/c17-14-12-6-2-1-5-11(12)8-10-16(14)13-7-3-4-9-15-13;1-8(2)10-6-4-9(3)5-7-10;1-2(3)4;/h1-7,9-10H;4-8H,1-3H3;1H3;/q;;-2;+2
charge 0 multiplicity 1
58 atoms
C  -0.5017682 0.56971313 0.03951793
C  -1.34163736 -0.49392903 0.06068947
N  -2.7429592 -0.4065669 0.02027443
C  -3.40035339 0.83631805 -0.04733456
C  -2.50964747 2.01233094 -0.07725779
C  -1.09508394 1.89272954 -0.03210669
C  -0.33315586 3.08489674 -0.07659604
C  -0.9466054 4.32552141 -0.16847965
C  -2.34894979 4.42990672 -0.2178706
C  -3.11962628 3.27821271 -0.17021989
H  -0.98935412 -1.52074056 0.1070982
O  -4.62159154 0.92767455 -0.09481603
H  -4.20951204 3.31396988 -0.20517062
H  -2.82557874 5.41023177 -0.29026734
H  -0.33311051 5.22999614 -0.19782722
H  0.75198455 3.01201537 -0.01988916
C  -3.47332008 -1.63254654 -0.04273413
C  -4.78033144 -1.75544107 0.46479803
N  -2.81984935 -2.66013935 -0.58679172
C  -5.39970013 -2.99893785 0.37496273
C  -3.42214595 -3.84723936 -0.65972317
C  -4.71892966 -4.07539918 -0.20074885
H  -5.28430681 -0.89645207 0.89568062
H  -6.41401664 -3.12494403 0.76146525
H  -2.84122354 -4.65865844 -1.11327332
H  -5.17619665 -5.06276765 -0.28816169
C  2.35756822 -1.52207154 -0.99333269
C  1.406744 -0.91130552 -1.84852133
C  3.54074748 -0.83387903 -0.54007718
H  0.5265662 -1.47223941 -2.16593967
C  1.51836095 0.48016808 -2.17205551
C  3.62987923 0.53022872 -0.84789415
H  4.44355062 1.12282877 -0.4240149
C  2.60700513 1.19502757 -1.6079975
H  2.67018617 2.27397766 -1.75921028
H  2.1808549 -2.55023193 -0.67471238
C  0.48285855 1.15928296 -3.02022874
H  -0.51024861 0.72190591 -2.84977803
H  0.42351669 2.23200136 -2.79306402
H  0.73463132 1.04128219 -4.08738441
C  4.59998193 -1.52611382 0.29381003
H  5.1622418 -0.72722921 0.80663214
C  5.57750785 -2.27893032 -0.6238387
C  4.01478649 -2.44915158 1.36938953
H  3.25712106 -1.92961893 1.97277466
H  3.53867901 -3.33779681 0.92429439
H  4.81583857 -2.81109865 2.03236965
H  5.05545777 -3.07426921 -1.18111452
H  6.37887657 -2.75177092 -0.03422462
H  6.04297295 -1.60370256 -1.35830112
Ru 1.53363121 0.20363521 0.01137622
O  1.62868431 1.50161582 1.72229792
C  1.31227402 0.54689937 2.4968361
O  1.2073104 -0.60766803 1.97877458
C  1.01710276 0.78427542 3.94675264
H  -0.05342465 1.02857668 4.04356363
H  1.21978617 -0.1204856 4.53491848
H  1.59888146 1.63575745 4.32403558
