program: Gaussian 16
title: Input
version: ES64L-G16RevA.03
method: RB3LYP
basis: def2SVP
operation: Freq
keyword: #N
keyword: Geom=AllCheck
keyword: Guess=TCheck
keyword: SCRF=Check
keyword: GenChk
keyword: RB3LYP/def2SVP
keyword: Freq
converged: YES YES NO YES
title: Mulliken charges:
elementType: C C N C C C C C C C H O H H H H C C N C C C H H H H C C C H C C H C H H C H H H C H C C H H H H H H Ru C C C C C C H H H H H C C C H H H H O
charge: -0.114165 0.041617 -0.211796 0.192185 -0.062647 0.179716 -0.048504 0.045090 0.016276 0.002505 -0.006979 -0.255763 -0.012368 -0.020338 -0.017543 -0.030460 0.212284 -0.020110 -0.237943 0.063682 0.130076 0.003908 0.025103 0.000595 0.032215 -0.008345 -0.014936 0.018668 0.029844 -0.034968 -0.060078 0.005862 0.019298 -0.056603 0.018726 -0.026304 0.092576 0.031269 0.029163 0.005950 -0.075868 0.025516 0.046253 0.053942 0.004341 0.002356 0.012752 0.002747 0.012485 0.023161 -0.093624 0.066860 -0.020817 -0.006266 0.019259 0.027958 0.026377 -0.026891 -0.006942 -0.018073 -0.017969 -0.014874 0.232098 -0.196692 0.070547 0.225614 -0.014596 0.026508 0.035592 -0.378511
chargesum: -0.00000
title: Mulliken charges with hydrogens summed into heavy atoms:
elementType: C C N C C C C C C C O C C N C C C C C C C C C C C C C Ru C C C C C C C C C O
charge: -0.121144 0.041617 -0.211796 0.192185 -0.062647 0.179716 -0.078964 0.027547 -0.004062 -0.009863 -0.255763 0.212284 0.004992 -0.237943 0.064277 0.162291 -0.004436 -0.041240 -0.016300 0.029844 -0.060078 0.025160 -0.037878 0.158958 -0.050352 0.084645 0.073391 -0.093624 0.066860 -0.047708 -0.013209 0.001185 0.009989 0.011503 0.232098 0.014327 0.132646 -0.378511
chargesum: 0.00000
1716.lowfreq: -1511.9137 -5.7611 -4.0496 -2.4107 -0.0004 -0.0001 0.0006 16.3515 18.7325
frequency: -1511.9137 16.2830 18.7260 29.3112 33.9331 40.5718 42.9213 43.5858 48.6011 61.0928 71.7857 75.8493 95.1746 100.9486 104.8902 113.4138 121.1136 132.6787 150.6384 157.8596 170.1668 188.1708 197.5502 217.7650 230.4115 235.7643 255.2605 265.9118 269.6194 284.0117 295.4564 301.6994 320.1602 326.7397 331.8506 354.2703 367.7075 389.7575 404.9323 414.0852 420.6512 421.0429 430.8888 447.8871 450.2581 472.0985 482.3693 514.4236 520.7050 529.9374 539.6871 561.3799 566.3391 567.5493 570.7423 595.0346 632.8580 637.0564 653.1596 659.7363 675.3586 691.1460 698.2204 709.4707 714.2481 716.1871 729.0396 738.8355 744.0806 772.4193 775.2122 777.8108 789.7404 818.1421 821.6170 825.9293 828.0763 843.0048 847.1400 866.9349 874.2564 885.4467 896.2593 907.1200 907.8404 909.0870 934.6078 941.5114 956.2910 967.8631 973.3988 976.0449 978.6730 991.2229 996.7504 1000.6087 1010.0750 1010.8761 1016.8589 1025.4602 1028.5195 1030.7147 1032.0388 1048.4726 1050.6442 1050.9358 1052.2449 1067.2580 1074.1875 1081.1835 1093.1483 1094.9639 1111.2739 1114.7049 1119.5405 1131.6770 1131.9000 1143.7906 1155.1424 1160.9856 1163.0829 1169.3679 1172.8506 1186.5151 1198.4360 1219.3795 1234.6147 1240.6696 1260.0719 1266.2210 1297.7841 1310.1151 1318.4263 1319.5215 1332.1266 1334.7302 1338.2289 1345.4152 1348.4516 1359.5921 1372.4077 1374.1409 1388.7442 1398.4141 1402.2522 1409.3237 1426.8787 1434.2391 1443.1866 1457.9653 1459.2358 1464.5789 1468.7477 1470.2321 1473.5310 1474.9659 1475.6788 1487.9933 1509.7582 1516.2303 1518.0029 1542.9966 1551.3741 1586.6944 1616.4458 1618.8600 1635.4618 1639.4390 1655.1827 1658.9460 1660.8152 1665.4046 1749.5264 2877.2516 3023.8578 3026.2499 3034.6713 3056.7369 3090.4991 3107.3701 3113.3318 3116.5732 3118.4498 3121.6129 3139.9675 3152.3747 3171.6916 3172.9367 3173.5668 3174.6045 3183.4065 3185.7753 3193.6184 3193.7848 3194.9406 3195.2428 3199.4381 3200.6646 3205.8787 3208.9037 3214.2246 3215.9034 3217.6293 3287.1535
redmass: 1.1263 4.1399 6.0884 4.9256 3.9590 1.3663 5.3455 2.5663 4.8686 3.8231 4.2119 3.7274 3.9493 4.3019 4.1784 4.0124 4.8785 5.2337 4.6595 5.6355 5.7622 6.2266 2.6224 6.0876 2.0402 5.8725 1.2956 7.8960 3.9011 4.6356 1.1986 4.6874 2.7520 5.3311 7.7991 2.6588 7.8087 5.7583 3.1409 4.7297 3.0156 6.1613 3.1148 2.8582 3.3868 3.7834 3.5990 3.0468 3.6425 7.5290 4.4727 3.3818 4.2248 5.8995 2.7799 7.3904 6.1962 4.8315 6.7942 6.6281 6.5979 4.2746 3.2631 3.9180 3.2302 1.5272 6.3123 2.6348 1.5478 1.5055 1.6290 1.4605 2.1530 3.2090 3.5942 4.5345 3.1768 1.4302 1.3786 1.2646 1.2369 2.3617 6.1974 1.6693 1.7622 1.7851 1.1709 5.5309 1.5152 1.4107 1.3323 1.5132 1.7630 1.3882 1.3852 1.3805 1.4009 1.3543 5.4869 1.3504 1.3173 2.5068 1.3711 3.5006 1.8539 1.7361 3.2072 1.5417 2.0468 1.5712 2.2926 1.5154 2.1944 1.9716 1.9644 1.6542 1.5010 1.5773 1.3942 1.9053 1.1785 1.0830 1.4138 1.1226 1.1193 1.8054 2.4690 2.1213 1.9081 1.8753 2.1287 1.8741 1.5046 1.4546 1.3523 3.0959 1.3956 4.8920 2.1934 2.5677 5.0389 2.1859 1.3260 1.2854 8.0947 1.2759 1.5002 1.9809 2.1678 1.0518 1.0670 1.0688 2.2392 1.2490 2.7445 2.4091 1.0812 1.0784 2.8506 2.9855 2.8181 2.7535 4.0603 6.6505 5.8535 6.6205 6.8287 6.2659 6.2332 6.0823 6.0516 6.4617 11.9547 1.0689 1.0382 1.0360 1.0417 1.0823 1.1015 1.1031 1.1011 1.0926 1.1035 1.1034 1.1019 1.0907 1.0866 1.0902 1.0861 1.0902 1.0906 1.0922 1.0938 1.0887 1.0955 1.0954 1.0915 1.0926 1.0954 1.0927 1.0952 1.0940 1.0995 1.0938
irintensity: 3864.1357 0.0290 0.1687 0.1339 0.4802 0.1455 1.3833 0.3918 0.5497 0.3911 0.1501 0.2246 0.2104 1.0425 1.3117 2.1189 0.1699 0.7962 2.2793 0.1308 2.2959 0.3292 0.7736 2.6229 0.3267 1.9714 0.2359 0.7911 2.6314 3.6635 0.2984 0.7541 0.1262 0.3240 4.3108 0.0069 5.7558 21.2501 5.2436 19.1906 0.0933 12.6720 1.3574 0.4450 0.1299 2.7506 2.0366 10.6068 4.2519 1.5981 6.9306 5.0727 87.2684 2.1709 13.1174 0.9928 1.8691 15.4982 0.1502 7.1643 3.7424 7.4406 0.4474 9.1320 11.8428 26.4334 0.8497 6.8424 29.8610 33.4038 7.0977 20.3444 38.6428 8.2693 1.2777 0.2740 8.1847 30.9477 14.8745 0.0891 10.8670 6.6520 2.5515 2.9693 1.6272 4.6582 0.9053 4.9723 3.5421 1.2055 5.5286 3.5253 2.2537 0.2388 2.4533 0.7523 1.0405 11.1299 0.5124 0.0308 1.1029 1.4754 0.3591 18.2837 13.4620 6.4449 18.8503 11.4874 8.4218 1.3300 15.3289 6.7298 11.3827 27.9692 4.2248 2.7675 2.0262 4.5102 37.1595 3.4250 1.3823 0.7067 42.9530 13.7884 0.4055 9.4557 0.4793 0.6625 15.6981 0.5594 16.9543 27.8971 0.4424 10.7880 0.3733 28.7427 9.3281 18.8563 17.0674 41.7264 2.1934 4.4508 5.6813 1.5051 43.9327 4.6259 23.0809 2.0004 89.4583 6.9566 8.0340 6.0076 56.2214 6.1190 3.8670 34.5460 6.3061 0.9696 135.9541 145.1974 24.4848 22.3779 42.4147 413.3595 14.0100 9.1655 112.4125 8.2240 12.7707 4.6977 1.3910 158.0608 284.0732 55.0195 25.6847 22.9527 22.6857 2.2020 9.3888 1.2337 30.0442 20.4664 20.0067 10.0903 12.1357 27.8898 3.4718 10.5942 1.0957 0.4769 9.2463 9.7798 1.0339 0.6076 23.4851 19.3821 1.0285 4.6151 12.2111 3.7974 7.7860 2.7535 5.3829 19.5063
temp: 298.150 k
press: 1.00000 atm
elementType: 6 6 7 6 6 6 6 6 6 6 1 8 1 1 1 1 6 6 7 6 6 6 1 1 1 1 6 6 6 1 6 6 1 6 1 1 6 1 1 1 6 1 6 6 1 1 1 1 1 1 44 6 6 6 6 6 6 1 1 1 1 1 6 6 6 1 1 1 1 8
symmnumber: 1
zpe: 1478956.6 jmol-1
zpe.correction: 0.563305 hartree
zpe.thermalcorrener: 0.597546 hartree
zpe.thermalcorrenthalpy: 0.598490 hartree
zpe.thermalcorrgfe: 0.495138 hartree
zpe.sumelectzpe: -1630.188784 hartree
zpe.sumelectthermal: -1630.154543 hartree
zpe.sumelectthermalent: -1630.153599 hartree
zpe.sumelectthermalfe: -1630.256950 hartree
dipole: -0.0628 -3.6398 0.7110
dipole: 3.7091
quadrupole: -231.2709 -221.0212 -236.7785
quadrupole: -13.7198 -0.0206 9.4196
quadrupole: -1.5807 8.6690 -7.0883 -13.7198 -0.0206 9.4196
hfenergy: -1630.7520887 hartree
pointgroup: C01 [X(C33H32N2O2Ru1)]
dipole: 0.1501584 -1.4505677 -0.053196 debye
polarizability: 556.0530535|18.0672678|477.798933|-36.5202677|-68.6262756|335.7529816 unknown
InChI: InChI=1S/C14H9N2O.C10H14.C9H8O.Ru.H/c17-14-12-6-2-1-5-11(12)8-10-16(14)13-7-3-4-9-15-13;1-8(2)10-6-4-9(3)5-7-10;1-2-9(10)8-6-4-3-5-7-8;;/h1-9H;4-8H,1-3H3;2-7H,1H2;;/q-1;;-1;+2;
charge 0 multiplicity 1
70 atoms
C  0.0170948 1.79150344 -0.12948866
C  -0.37961231 0.65113524 0.51577869
N  -1.67469248 0.60734649 1.10724728
C  -2.58844866 1.70107826 1.06150679
C  -2.12506069 2.88710819 0.33760704
C  -0.83482331 2.93249835 -0.24752659
C  -0.45364112 4.10915355 -0.93825265
C  -1.32393272 5.18236083 -1.03943121
C  -2.60692211 5.12709857 -0.45638741
C  -2.99885308 3.98647027 0.22718051
H  1.01255403 1.81509397 -0.57426694
O  -3.6966957 1.63395976 1.57868833
H  -3.98225876 3.90671029 0.6927654
H  -3.28500222 5.97879601 -0.54275558
H  -1.01262918 6.08181339 -1.57719144
H  0.53963257 4.15561684 -1.39142551
C  -2.01115941 -0.61828278 1.70587216
C  -3.19234136 -0.90358168 2.41214674
N  -1.05010861 -1.56510169 1.54986756
C  -3.36525793 -2.17438491 2.9523505
C  -1.22687081 -2.78690733 2.08932244
C  -2.36707855 -3.13980819 2.79408643
H  -3.93675958 -0.12322989 2.51842075
H  -4.28024925 -2.40317318 3.50281402
H  -0.40875803 -3.49203812 1.9325108
H  -2.4625973 -4.14388545 3.20924753
C  -2.49466493 -2.39595157 -1.29155223
C  -1.7157681 -3.52397418 -1.00528764
C  -1.91516135 -1.22086691 -1.78347221
H  -2.2021577 -4.42098291 -0.61320559
C  -0.33008839 -3.52486131 -1.19377188
C  -0.51934743 -1.21531535 -1.98039247
H  -0.03588797 -0.3212207 -2.37839024
C  0.26618736 -2.34256868 -1.69107556
H  1.33400862 -2.32229555 -1.92225796
H  -3.56929357 -2.43969237 -1.11226887
C  0.51103743 -4.74109015 -0.89971129
H  0.84561019 -5.22930724 -1.83087036
H  1.4203135 -4.47734799 -0.33552613
H  -0.0493246 -5.48739404 -0.31727819
C  -2.71445597 0.02399664 -2.13372347
H  -2.1507605 0.87693695 -1.72141767
C  -4.12204754 0.05652701 -1.53621456
C  -2.76930937 0.21535893 -3.65973819
H  -1.76186215 0.25072853 -4.10127803
H  -3.3162463 -0.61479872 -4.13617817
H  -3.28424179 1.15561419 -3.912963
H  -4.77151895 -0.70814124 -1.99336797
H  -4.58567369 1.03703339 -1.72140651
H  -4.11894425 -0.10115707 -0.44890017
Ru 0.61373441 -1.0630079 0.51806945
C  4.50736346 0.51271115 -0.01772931
C  5.54535349 0.89322901 0.85211609
C  4.68663635 0.68872668 -1.40234516
C  6.72318437 1.44764343 0.35143405
C  5.86753266 1.2356766 -1.90154786
C  6.88897447 1.62028915 -1.02651042
H  5.43452114 0.73954831 1.9264991
H  3.87745285 0.39047032 -2.06982317
H  7.52077384 1.73860776 1.03926935
H  5.99293183 1.36790415 -2.97909537
H  7.81413887 2.05077707 -1.41750694
C  3.23769286 -0.06244109 0.47493715
C  2.79806854 -0.02936254 1.81320989
C  1.81078554 -1.12795224 2.17636797
H  1.43663284 0.28359394 1.34411408
H  3.37598807 0.49187085 2.58228507
H  2.21846532 -2.16581962 2.10619365
H  1.33981236 -0.97377252 3.15611035
O  2.43422694 -0.58729339 -0.4009256
