program: Gaussian 16
title: Transition State
version: ES64L-G16RevA.03
frameworkgroup: C1[X(C9H10O)]
method: RB3LYP
basis: def2SVP
operation: Freq
keyword: #N
keyword: Geom=AllCheck
keyword: Guess=TCheck
keyword: SCRF=Check
keyword: GenChk
keyword: RB3LYP/def2SVP
keyword: Freq
converged: YES YES NO YES
title: Mulliken charges:
elementType: C C C H H H H O H C C C C C C H H H H H
charge: -0.005897 0.036036 -0.034723 0.037637 0.033268 0.027390 0.025889 -0.265839 0.169082 0.124941 -0.053709 -0.047350 0.021523 0.027782 0.019680 -0.028885 -0.029158 -0.020245 -0.018785 -0.018636
chargesum: -0.00000
title: Mulliken charges with hydrogens summed into heavy atoms:
elementType: C C C O C C C C C C
charge: 0.065008 0.036036 0.018556 -0.096757 0.124941 -0.082595 -0.076507 0.001277 0.008997 0.001044
1716.lowfreq: -4.4335 -2.8285 -0.0009 -0.0002 0.0005 6.8201 49.0638 139.9406 211.9455
frequency: 49.0589 139.9402 211.9451 315.1296 336.9498 377.4482 415.9144 424.8141 465.7533 502.3858 566.9638 635.1819 715.4986 724.0373 774.8912 780.5925 863.8304 887.1133 903.9501 918.8741 951.1823 993.1559 1005.1921 1015.2097 1028.0144 1045.4112 1055.1966 1067.8854 1102.6760 1124.2947 1169.6993 1176.5018 1195.5513 1257.4909 1316.2753 1345.2077 1357.7970 1377.3703 1423.9711 1469.9079 1493.0465 1531.5056 1640.1806 1666.7660 3127.3220 3130.3579 3171.3647 3178.8275 3188.5691 3198.2238 3211.3417 3222.3807 3233.7107 3785.5678
redmass: 3.8004 3.4192 3.8687 3.0504 2.3712 1.3501 3.1089 2.7353 3.5509 3.8589 2.8606 6.3402 5.4687 1.6576 1.0616 1.8721 1.2658 2.2037 2.6550 1.3409 1.6531 1.7639 1.3861 5.0832 1.3363 1.7269 2.3180 1.4500 1.5269 2.3602 1.0761 1.2818 1.1231 1.9499 1.7065 1.8788 2.4141 3.6267 1.0935 1.8114 2.0671 2.4793 6.1353 6.0603 1.0522 1.0582 1.0855 1.0891 1.0937 1.0983 1.0939 1.1216 1.1185 1.0662
irintensity: 0.5526 1.3613 0.2782 3.1629 10.5107 94.3896 4.4359 3.9740 21.6747 14.3375 14.7671 0.0744 2.0003 28.1702 1.0045 26.1824 0.4949 9.9844 12.3722 11.3908 3.0343 3.7116 0.1115 0.3992 0.2543 15.2391 9.9145 2.1603 7.3203 10.1722 0.1515 0.0777 0.5857 100.3520 5.4319 8.9811 27.0818 0.5082 4.1806 1.7994 18.4297 16.3345 0.6698 13.2914 9.3255 2.9265 2.7082 4.8765 22.1074 13.9586 4.2508 1.6003 5.0614 24.5321
temp: 298.150 k
press: 1.00000 atm
elementType: 6 6 6 1 1 1 1 8 1 6 6 6 6 6 6 1 1 1 1 1
symmnumber: 1
zpe: 438236.5 jmol-1
zpe.correction: 0.166915 hartree
zpe.thermalcorrener: 0.175327 hartree
zpe.thermalcorrenthalpy: 0.176272 hartree
zpe.thermalcorrgfe: 0.133485 hartree
zpe.sumelectzpe: -423.729215 hartree
zpe.sumelectthermal: -423.720803 hartree
zpe.sumelectthermalent: -423.719859 hartree
zpe.sumelectthermalfe: -423.762645 hartree
dipole: -0.1606 -0.5250 -1.0959
dipole: 1.2258
quadrupole: -57.1991 -56.1931 -60.2876
quadrupole: -1.0729 -2.1890 -2.3326
quadrupole: 0.6942 1.7002 -2.3944 -1.0729 -2.1890 -2.3326
hfenergy: -423.8961303 hartree
pointgroup: C01 [X(C9H10O1)]
dipole: -0.0629235 -0.2087777 -0.4301392 debye
dipolederiv: 0.0019966 0.0488041 -0.0941076 -0.1718723 0.0288057 0.06129 -0.1872933 0.073032 -0.097079 0.1477293 0.2223105 -0.0866627 0.3315345 0.6628565 -0.0526957 -0.1759554 -0.0236366 0.3297503 -0.015025 0.1111815 0.079997 -0.0048866 -0.0836655 -0.0660351 0.2308276 -0.1098587 -0.0711721 -0.0415118 -0.0313055 -0.0533134 -0.0105897 0.0540807 -0.0270725 -0.0359244 0.0038645 0.0103504 0.0387459 -0.0711848 0.0460677 -0.0431176 0.0236158 0.0530435 0.0082765 0.0244884 -0.0104864 0.0376073 -0.0731925 -0.0243173 -0.0382985 -0.0229345 -0.0591711 0.0072901 -0.0404808 0.0103944 -0.0435761 -0.0234219 0.0723027 -0.0296242 0.0468603 0.0186566 0.0472787 -0.0134335 0.0088162 -0.6947068 -0.1811244 0.1125518 -0.0561041 -0.8315291 0.0649449 0.0987446 0.0386474 -0.2418679 0.3481105 0.0424356 -0.0898505 0.0194549 0.261628 -0.0283584 -0.0770679 0.0192925 0.1503414 0.4488201 -0.0895634 0.037272 0.0153896 -0.1581566 0.0230934 0.0851269 0.0058574 -0.0585216 -0.1530164 -0.0410081 -0.0064229 -0.1527891 0.0158925 0.003522 0.0092065 0.0063405 -0.1204194 -0.2160075 0.0740408 0.0069219 0.0986268 0.0027076 0.0182866 -0.0064636 0.0231534 -0.1100618 0.0266214 0.0177165 0.0041973 0.0807227 0.112094 0.0128171 -0.0012723 0.0129569 -0.1079546 0.0660097 -0.0550764 -0.0085656 -0.0716635 0.10314 0.0139022 -0.0069484 0.0177458 -0.1087935 0.0155419 0.0235248 -0.0035171 -0.0050074 -0.121207 0.0038179 -0.0035842 -0.0018253 -0.1214312 0.0207895 0.084909 0.0055836 0.0905543 -0.0273818 -0.0110615 0.0069975 -0.0087187 0.1022232 0.0937007 -0.0654128 -0.0042368 -0.0506933 -0.0132921 -0.0034534 -0.0063168 -0.0035625 0.1039726 0.0223712 -0.0590937 -0.0024077 -0.0752651 -0.067995 -0.0105577 -0.0041891 -0.0104796 0.1085931 0.0002 0.0755316 0.0062571 0.0845568 -0.051451 -0.0119231 0.0102912 -0.0110695 0.1078354 -0.1044003 -0.0100708 0.0022506 -0.0109283 0.0659315 -0.0030456 0.000976 -0.0023135 0.1155105 unknown
polarizability: 126.6852106|-3.4911758|99.3843816|-0.4871857|1.1095193|59.0567026 unknown
InChI: InChI=1S/C9H10O/c10-9(6-7-9)8-4-2-1-3-5-8/h1-5,10H,6-7H2
charge 0 multiplicity 1
20 atoms
C  2.26314 -0.675102 0.889035
C  1.434306 0.191005 -0.023298
C  2.311088 -0.900382 -0.600251
H  3.120524 -0.185116 1.356951
H  1.734289 -1.397699 1.515759
H  1.840972 -1.792102 -1.022298
H  3.203647 -0.556077 -1.128827
O  1.918095 1.499204 -0.143468
H  1.729207 1.797468 -1.044488
C  -0.061349 0.058926 -0.020744
C  -0.703953 -1.189128 -0.089284
C  -0.855368 1.211994 0.072236
C  -2.096239 -1.278353 -0.07031
C  -2.249775 1.12279 0.086354
C  -2.877887 -0.121943 0.014403
H  -0.116514 -2.107387 -0.157103
H  -0.364678 2.183036 0.146808
H  -2.574494 -2.259516 -0.124971
H  -2.847773 2.034744 0.159678
H  -3.968003 -0.193089 0.026056
