program: Gaussian 16
title: COF
version: ES64L-G16RevC.01
frameworkgroup: C1[X(C24H22CoN4)]
method: UPBE1PBE
basis: Gen
operation: Freq
keyword: #P
keyword: Geom=AllCheck
keyword: Guess=TCheck
keyword: SCRF=Check
keyword: GenChk
keyword: UPBE1PBE/ChkBas
keyword: Freq
converged: YES YES NO YES
polarizability: 6.82422565e+02 1.83284980e-04 2.67889205e+02 3.94786680e-04 9.11452139e-01 1.98429362e+02
1716.lowfreq: -0.0060 -0.0034 0.0020 0.3349 1.2776 2.6683 11.5818 16.0470 18.9995
frequency: 11.5545 16.0467 18.9988 31.1190 31.5645 38.6386 71.0172 81.7190 86.7420 102.6934 105.9613 124.3251 143.8172 163.1783 173.7812 218.8393 233.9481 237.6552 243.5072 269.1096 324.5089 330.9186 345.9113 398.5002 399.3608 400.1541 424.6036 424.7435 426.7845 430.2753 442.3510 474.7912 501.3132 522.5846 529.4236 529.8038 544.8166 558.1702 597.8933 629.5401 629.7035 653.2240 675.3859 682.5305 709.8484 714.9490 715.0909 741.7505 760.2638 776.7258 776.7934 812.6059 826.7298 830.2601 830.3282 837.3934 857.5292 883.9895 890.6986 895.3577 895.4379 931.8662 935.1711 979.0703 984.3538 984.5774 986.3274 997.6101 997.6719 1004.1127 1004.1311 1006.8751 1006.8823 1039.4395 1040.2964 1046.2206 1061.6936 1061.7892 1108.2780 1108.3365 1157.8687 1159.7131 1164.5272 1170.8842 1171.1985 1171.4664 1196.6519 1196.6904 1235.5674 1235.7492 1245.4915 1257.3352 1267.5172 1294.3653 1296.8463 1309.1546 1347.5209 1347.8065 1361.1465 1367.6131 1373.2336 1378.4691 1392.0440 1407.5716 1412.2573 1441.3575 1457.3205 1472.7351 1474.1646 1490.0962 1490.3824 1521.3846 1525.4430 1525.8292 1555.0673 1563.7452 1568.0106 1568.6373 1586.1798 1645.1126 1661.6741 1661.8492 1669.3584 1699.1683 1700.2339 2981.3461 2981.4424 3037.5885 3037.6980 3174.5330 3175.2130 3187.6454 3187.6546 3199.9530 3199.9647 3208.9184 3208.9216 3209.2723 3211.1724 3226.1355 3226.1572 3231.3971 3232.0831 3232.0835 3240.5394 3652.2038 3652.2592
redmass: 5.7493 7.1471 4.6195 4.0880 4.3098 5.4178 4.6351 5.6965 3.7796 4.5204 7.1416 5.9087 5.4955 3.5042 8.3610 4.4782 4.0470 4.2123 6.0561 7.0550 3.6654 4.5777 3.5138 2.4015 1.4767 2.1027 2.9919 2.9583 3.0227 3.3691 3.4113 3.5554 3.2309 2.9070 2.6226 2.6301 5.2483 2.7971 5.9824 6.3074 6.3270 5.3141 7.3333 6.6291 4.4486 1.6654 1.6861 4.4486 3.3738 1.9456 1.9452 1.4623 1.9383 1.2652 1.2829 5.2140 5.6590 3.3104 3.2905 1.6038 1.6258 1.4446 1.4324 1.3601 1.3594 1.3612 1.3126 1.7331 1.7109 5.0756 5.0622 1.3076 1.3084 2.4786 2.7477 5.7079 2.0829 2.0839 1.5594 1.5552 2.2577 1.5392 1.9746 1.3034 1.0627 1.2910 1.1063 1.1061 1.1206 1.1221 1.8033 1.9843 1.8566 1.5860 1.6400 1.3729 1.4920 1.4872 1.9232 2.7108 3.7592 2.1141 2.3078 5.3313 4.0450 3.4939 5.3123 2.1505 2.1644 1.0920 1.0958 3.3706 2.0939 2.0795 4.3088 5.2999 3.6702 3.3795 6.2986 5.7494 5.9208 5.8902 6.2845 6.4754 6.4770 1.0657 1.0658 1.0988 1.0987 1.0925 1.0927 1.0882 1.0882 1.0881 1.0881 1.0944 1.0944 1.0887 1.0898 1.0955 1.0955 1.0976 1.0974 1.0974 1.0940 1.0772 1.0772
irintensity: 0.0206 0.2290 0.0294 0.0066 0.1555 0.2724 0.1221 0.3851 0.2364 3.2737 5.0866 0.1286 4.3695 2.0078 4.4574 2.6509 0.0107 0.0509 2.5365 8.4316 2.1596 0.2256 3.1028 26.4807 252.9393 24.8652 0.1455 2.5595 11.5171 23.7652 15.0497 70.1558 0.2017 20.1575 6.5282 10.3773 5.5435 3.8264 3.2892 0.2210 0.5497 2.3405 0.1119 2.1475 15.1199 0.0696 55.8104 3.9239 0.0412 2.1088 77.7028 32.4492 0.8327 0.0488 0.6738 74.7265 0.5629 0.2259 0.8584 0.1807 13.0013 1.1633 9.2255 0.6660 0.0166 0.3389 0.0345 0.4235 11.0423 8.0066 0.2634 1.1477 0.5011 0.0992 7.3057 145.1681 0.3497 6.8289 2.9490 11.1715 34.1674 4.4286 25.4124 2.4089 0.7238 12.6057 18.0615 0.8927 9.0256 13.5090 1.8526 9.2420 0.5565 198.7821 1.6131 2.3958 4.8951 254.0018 2.7040 16.6945 277.5762 8.8642 9.5649 170.5759 40.7545 59.4186 8.2928 202.4794 10.5711 95.0072 4.2263 80.6775 39.6744 0.1810 18.4331 1120.9426 282.8141 63.2663 27.4155 19.1464 0.2892 17.2206 93.9573 571.5800 39.7726 1.3827 89.7171 15.9170 40.0467 43.3894 10.8870 23.4111 0.2993 7.9040 0.2352 6.2400 23.0795 1.3445 2.0872 35.1806 13.1683 0.1727 0.7124 4.5375 7.4350 73.0859 11.8235
temp: 298.150 k
press: 1.00000 atm
elementType: 27 7 7 7 7 6 6 6 6 6 6 6 6 6 6 6 6 6 6 6 6 6 6 6 6 6 6 6 6 1 1 1 1 1 1 1 1 1 1 1 1 1 1 1 1 1 1 1 1 1 1
symmnumber: 1
zpe: 1083892.0 jmol-1
zpe.correction: 0.412833 hartree
zpe.thermalcorrener: 0.438003 hartree
zpe.thermalcorrenthalpy: 0.438947 hartree
zpe.thermalcorrgfe: 0.351318 hartree
zpe.sumelectzpe: -2526.828786 hartree
zpe.sumelectthermal: -2526.803616 hartree
zpe.sumelectthermalent: -2526.802671 hartree
zpe.sumelectthermalfe: -2526.890301 hartree
dipole: 0.0000 2.7868 -1.7178
dipole: 3.2737
quadrupole: -213.9616 -161.5517 -175.3054
quadrupole: 0.0002 -0.0000 -1.4296
quadrupole: -30.3553 22.0545 8.3008 0.0002 -0.0000 -1.4296
hfenergy: -2527.2416182 hartree
pointgroup: C01 [X(C24H22Co1N4)]
dipole: -0.000008 1.1109935 -0.6515893 debye
polarizability: 682.4225652|0.0059557|267.8156539|-0.000536|2.4360131|198.5029124 unknown
InChI: InChI=1S/C24H22N4.Co/c1-3-7-21(8-4-1)25-15-19-11-13-23(27-17-19)24-14-12-20(18-28-24)16-26-22-9-5-2-6-10-22;/h1-14,17-18,25-26H,15-16H2;/q-2;+2
charge 0 multiplicity 4
51 atoms
Co 0.00002162 2.46485836 -0.85903225
N  1.35376563 1.3069734 -0.05381264
N  5.57621867 -0.6533282 -0.09226169
N  -1.35370447 1.30694317 -0.05382431
N  -5.57612045 -0.65347045 -0.09226585
C  9.69726472 -1.35829378 -0.5365114
C  8.75342485 -2.1938785 -1.13934162
C  9.24689384 -0.27082172 0.20750789
C  7.3943095 -1.95142765 -0.99641962
C  7.88537849 -0.01004877 0.35467847
C  6.92971194 -0.8550583 -0.24054956
C  5.01292497 0.53891941 0.49040597
C  3.51941331 0.44186456 0.55932136
C  2.88091454 -0.6033755 1.28503586
C  2.69570162 1.34599421 -0.08303367
C  1.51119231 -0.66669002 1.32647911
C  0.71705055 0.29883161 0.65202765
C  -9.6971509 -1.358572 -0.53643923
C  -9.24680228 -0.27106109 0.20753678
C  -8.7532942 -2.19414989 -1.13925252
C  -7.88529276 -0.01024317 0.35468111
C  -7.39418413 -1.95165451 -0.99635608
C  -6.92960893 -0.85524555 -0.24052954
C  -5.01285077 0.53880406 0.4903681
C  -3.51933696 0.44178066 0.5592894
C  -2.69564141 1.34593105 -0.08305686
C  -2.88081992 -0.6034449 1.2850089
C  -1.51109648 -0.66672616 1.32646404
C  -0.71697197 0.29881519 0.65202103
H  6.66681771 -2.61925697 -1.46739901
H  9.96741233 0.40025463 0.68303367
H  7.56763379 0.85710509 0.93529745
H  5.4207851 0.65787435 1.51201563
H  3.48777156 -1.35147217 1.80106523
H  3.13671821 2.16504498 -0.66248439
H  1.02631301 -1.4670714 1.88645142
H  9.08185371 -3.05237691 -1.73140802
H  -9.96733433 0.40001083 0.68304825
H  -7.567566 0.85694064 0.93526527
H  -5.30349192 1.45546404 -0.06439128
H  -3.13667269 2.16497155 -0.66251091
H  -3.48766387 -1.35155647 1.80103204
H  -1.02620236 -1.4670966 1.88643919
H  -6.66667889 -2.61947892 -1.4673217
H  -9.08170543 -3.05267833 -1.73128516
H  10.76576075 -1.55256505 -0.64958232
H  -10.76564266 -1.55287838 -0.64948993
H  5.30354936 1.45560082 -0.06432677
H  4.98087176 -1.12495839 -0.76085329
H  -5.42071511 0.65778092 1.51197381
H  -4.98076495 -1.12511276 -0.76084102
