program: Gaussian 16
title: COF
version: ES64L-G16RevC.01
frameworkgroup: C1[X(C24H22CoN4)]
method: UM06
basis: Gen
operation: Freq
keyword: #P
keyword: Geom=AllCheck
keyword: Guess=TCheck
keyword: SCRF=Check
keyword: GenChk
keyword: UM06/ChkBas
keyword: Freq
converged: YES YES NO YES
polarizability: 6.90375955e+02 6.21878875e-05 2.77785261e+02 -3.26972332e-04 -3.45118673e+00 2.01432544e+02
1716.lowfreq: -6.2866 -5.9261 0.0020 0.0023 0.0027 2.0593 11.9419 16.6244 20.6719
frequency: 11.9278 16.4648 20.6614 32.0448 32.8031 36.7658 74.7588 82.6065 92.6143 105.7961 120.9247 122.6926 143.6539 163.6209 170.8613 216.1192 230.3504 236.9813 237.9479 261.2215 317.8808 327.0208 340.0761 393.4704 395.1463 395.6006 420.4889 420.5791 423.3347 425.6520 441.6650 468.4767 493.2611 517.6789 523.4150 524.2735 538.7431 557.1586 590.3763 623.0748 623.2308 646.7769 667.6860 673.7456 699.9749 706.1110 706.2216 732.6321 753.8839 767.3788 767.4427 802.7250 819.6042 820.0419 821.4584 828.9831 850.1045 875.5981 882.0670 883.2596 883.6877 923.7508 924.2144 969.2228 973.8966 974.3214 975.9888 980.6522 981.0015 993.0379 993.0563 997.1601 997.1773 1019.9489 1022.3706 1028.5034 1049.5587 1049.6006 1088.7469 1088.7751 1130.9260 1136.1275 1137.8719 1137.9033 1148.0279 1150.3673 1165.4122 1165.4255 1213.8067 1214.0486 1222.8772 1239.6332 1247.5602 1272.7382 1277.5154 1282.2790 1322.7355 1323.1425 1337.2357 1344.9323 1348.5965 1358.6082 1372.8299 1391.3525 1395.6222 1422.2105 1440.6348 1451.3724 1452.8637 1455.8264 1456.3721 1504.3478 1505.8339 1506.1317 1539.9657 1547.0019 1549.4984 1551.6860 1575.2634 1628.4976 1649.7406 1649.9883 1653.5512 1684.5893 1685.5974 2941.3772 2941.4958 2994.9161 2995.0191 3122.0588 3122.6927 3148.9887 3148.9986 3161.6023 3161.6167 3165.7374 3167.1058 3169.5551 3169.5599 3186.7610 3186.7894 3188.8826 3191.5576 3191.5593 3199.3318 3615.5257 3615.5789
redmass: 5.7997 6.8534 4.5441 4.5176 4.2390 4.9302 4.7736 5.5260 3.8077 4.3964 6.8899 6.1629 5.6108 3.4724 8.5588 4.3852 5.6576 4.1589 4.9017 5.8692 3.5594 4.6286 3.3279 3.1131 1.8262 1.5230 2.9753 2.9485 3.0152 3.1916 3.2455 3.5920 3.0390 2.9096 2.6170 2.6255 5.6824 2.7972 5.9684 6.2717 6.2866 5.2382 7.2054 6.6206 4.5408 1.6791 1.6927 4.3984 3.0146 1.9430 1.9427 1.4544 1.3604 1.2652 1.8987 5.0525 5.5628 3.2865 2.4284 1.6096 1.9498 1.4364 1.4301 1.3621 1.3917 1.3885 1.3182 1.7026 1.7019 4.7284 4.7128 1.2996 1.3000 2.2198 2.6762 6.4654 2.0328 2.0319 1.4718 1.4696 1.1652 1.4373 1.0576 1.0603 3.3633 2.5116 1.1014 1.1008 1.1240 1.1254 1.7848 1.8021 1.6840 1.4822 1.6045 1.4068 1.5394 1.5429 1.9831 2.5924 3.1709 2.4441 2.5210 5.8637 4.6716 3.8686 6.1671 2.0622 1.9381 1.1221 1.1731 3.5296 2.2591 2.1692 4.6736 3.8533 3.5795 5.8110 7.0730 6.1385 6.3500 6.2925 6.6666 6.8710 6.8744 1.0636 1.0637 1.1006 1.1006 1.0919 1.0922 1.0882 1.0882 1.0875 1.0875 1.0887 1.0900 1.0939 1.0939 1.0949 1.0949 1.0968 1.0975 1.0975 1.0930 1.0772 1.0772
irintensity: 0.0127 0.2088 0.0484 0.0053 0.1149 0.1751 0.0854 0.4202 0.8288 2.1002 7.7352 0.2807 3.6561 2.0264 4.1309 2.0099 3.4785 0.0366 7.1874 10.1676 2.6797 0.7532 4.5081 12.8573 33.6640 211.8301 0.3757 2.1693 13.7493 26.0578 16.2131 65.1183 0.1578 17.7778 6.9016 5.0755 6.9284 1.5350 3.6859 0.2802 0.4327 2.2000 0.0849 2.7871 14.0703 0.0654 43.1615 3.9798 0.0120 2.2019 73.0287 26.5970 1.0010 0.0526 0.4089 91.9306 0.8039 0.3264 2.1144 0.1057 12.1048 5.5904 1.3473 1.1996 0.0890 1.3117 0.0666 12.0707 0.7094 6.2501 0.2175 0.8360 0.7816 11.5811 8.0119 146.7717 0.2021 9.3002 4.0767 8.5359 13.7769 21.6011 0.1600 1.8153 17.2263 25.0079 14.6444 0.0981 7.7512 7.0588 2.6955 0.1120 1.4923 180.2918 2.4146 28.5012 6.2445 284.8458 1.6896 8.8060 268.6880 1.2934 10.9330 165.9219 41.2909 70.9140 10.1407 160.2052 5.7318 167.8567 8.6406 48.4009 88.5221 1.4582 13.6072 1344.2769 65.2262 69.9218 43.6913 19.9119 0.0001 16.3646 91.0896 559.5078 37.3987 3.4165 86.4810 15.8926 42.8682 54.2619 12.1447 27.8220 1.5387 12.3340 0.9315 0.0358 5.2419 4.5021 35.9502 49.9127 18.8806 0.8980 4.0516 5.4537 12.1601 70.0398 12.9382
temp: 298.150 k
press: 1.00000 atm
elementType: 27 7 7 7 7 6 6 6 6 6 6 6 6 6 6 6 6 6 6 6 6 6 6 6 6 6 6 6 6 1 1 1 1 1 1 1 1 1 1 1 1 1 1 1 1 1 1 1 1 1 1
symmnumber: 1
zpe: 1069623.3 jmol-1
zpe.correction: 0.407398 hartree
zpe.thermalcorrener: 0.432758 hartree
zpe.thermalcorrenthalpy: 0.433703 hartree
zpe.thermalcorrgfe: 0.346084 hartree
zpe.sumelectzpe: -2527.434188 hartree
zpe.sumelectthermal: -2527.408828 hartree
zpe.sumelectthermalent: -2527.407883 hartree
zpe.sumelectthermalfe: -2527.495502 hartree
dipole: 0.0001 2.2627 -1.4025
dipole: 2.6622
quadrupole: -210.8914 -163.8402 -175.9420
quadrupole: -0.0000 -0.0002 -0.3748
quadrupole: -27.3335 19.7176 7.6159 -0.0000 -0.0002 -0.3748
hfenergy: -2527.8415861 hartree
pointgroup: C01 [X(C24H22Co1N4)]
dipole: 0.0000081 0.8951631 -0.5437689 debye
polarizability: 690.3759552|0.0055142|277.8411891|-0.0011118|-2.7635636|201.3766161 unknown
InChI: InChI=1S/C24H22N4.Co/c1-3-7-21(8-4-1)25-15-19-11-13-23(27-17-19)24-14-12-20(18-28-24)16-26-22-9-5-2-6-10-22;/h1-14,17-18,25-26H,15-16H2;/q-2;+2
charge 0 multiplicity 4
51 atoms
Co 0.00000547 2.46828121 -0.87423984
N  1.3642049 1.31720169 -0.07544332
N  5.58079436 -0.66584463 -0.09251353
N  -1.36416098 1.31717424 -0.07542622
N  -5.58069495 -0.66598126 -0.09249679
C  9.70852177 -1.34365691 -0.50274819
C  8.7763428 -2.18337284 -1.11575375
C  9.24557863 -0.26242049 0.24055324
C  7.41554254 -1.94990006 -0.98306456
C  7.88189641 -0.01112601 0.37741056
C  6.9395702 -0.86026868 -0.22833628
C  5.01241385 0.52728756 0.48560998
C  3.52105895 0.43640123 0.5391314
C  2.87354394 -0.61242223 1.25067505
C  2.70689319 1.35078631 -0.09792435
C  1.50443397 -0.67047471 1.28550194
C  0.71735438 0.30451914 0.61816758
C  -9.7084011 -1.34392365 -0.50272158
C  -9.24548979 -0.26267437 0.24058112
C  -8.77619731 -2.18360888 -1.1157314
C  -7.88181519 -0.01133743 0.37743563
C  -7.415404 -1.95009373 -0.9830455
C  -6.93946372 -0.86044907 -0.22831596
C  -5.01234665 0.52715955 0.48563964
C  -3.52098904 0.43631395 0.53915529
C  -2.70685031 1.35072421 -0.09789922
C  -2.87344321 -0.61249712 1.25068902
C  -1.50433153 -0.67051461 1.28550763
C  -0.7172808 0.30450287 0.61817415
H  6.69163628 -2.61916067 -1.46184509
H  9.95881334 0.4122069 0.72460689
H  7.55184948 0.85284316 0.9599364
H  5.41396347 0.64399208 1.51328705
H  3.47745239 -1.36726776 1.76465467
H  3.16067215 2.17434601 -0.66614878
H  1.01276942 -1.47543084 1.83655501
H  9.11594317 -3.0384389 -1.70855741
H  -9.9587444 0.41192937 0.72463843
H  -7.55179364 0.85264037 0.95996309
H  -5.31333652 1.44768931 -0.06275756
H  -3.16065392 2.17427598 -0.66611544
H  -3.47732898 -1.36736192 1.76466704
H  -1.01264297 -1.47546256 1.83655125
H  -6.69147816 -2.61933045 -1.46182984
H  -9.11577231 -3.03868439 -1.70853599
H  10.78040109 -1.53043426 -0.60781413
H  -10.78027483 -1.53073443 -0.60778508
H  5.31337632 1.4478197 -0.06279844
H  4.99394376 -1.14108144 -0.77036246
H  -5.41389635 0.64384164 1.51331948
H  -4.99382555 -1.14121114 -0.77033384
