program: Gaussian 16
title: Input
version: ES64L-G16RevA.03
method: RB3LYP
basis: def2SVP
operation: Freq
keyword: #N
keyword: Geom=AllCheck
keyword: Guess=TCheck
keyword: SCRF=Check
keyword: GenChk
keyword: RB3LYP/def2SVPFreq
converged: YES YES NO YES
title: Mulliken charges:
elementType: C C C C C C C C N H H H H H C H H H C C O O H C O Co O C O C H H H C C C C C C O H C H H H C H H H C H H H C H H H C H H H C C C C C C H H H H H C C C C C C H H H H H C H H H C H H H C H H H
charge: -0.079538 0.016094 0.137212 -0.060599 0.032545 0.047614 -0.107607 0.200100 -0.102276 0.025330 -0.012235 0.017667 0.013554 0.068987 0.117833 0.075416 0.063303 0.072680 0.150197 0.087746 -0.205396 -0.288422 0.184908 -0.265041 -0.468258 0.164993 -0.309800 0.238821 -0.341547 0.094851 0.050515 0.048225 0.037211 -0.059081 -0.172566 -0.013233 -0.142501 -0.090516 0.341128 -0.309685 0.177745 0.123635 0.038666 0.018950 0.056817 0.119432 0.024761 0.031132 0.025821 0.100624 0.048172 0.035101 -0.013680 0.122890 0.001346 0.037842 0.064128 0.136280 0.026669 0.041873 0.021353 0.028687 -0.015521 0.009435 0.033508 0.013818 0.042970 -0.020544 -0.010972 -0.011924 -0.008592 -0.005059 -0.012261 0.001603 0.035995 0.028822 0.019897 0.044533 -0.000016 0.002189 0.004370 -0.000717 0.009197 0.076148 0.014724 0.021330 -0.002227 0.071615 0.009596 -0.020618 0.032655 0.082585 0.037538 -0.018247 0.007298
chargesum: 1.00000
title: Mulliken charges with hydrogens summed into heavy atoms:
elementType: C C C C C C C C N C C C O O C O Co O C O C C C C C C C O C C C C C C C C C C C C C C C C C C C C
charge: -0.054207 0.016094 0.137212 -0.072834 0.050212 0.061168 -0.107607 0.269087 -0.102276 0.329231 0.150197 0.087746 -0.205396 -0.103514 -0.265041 -0.468258 0.164993 -0.309800 0.238821 -0.341547 0.230802 -0.059081 -0.172566 -0.013233 -0.142501 -0.090516 0.341128 -0.131940 0.238069 0.201146 0.170218 0.226206 0.226174 0.028687 -0.036065 -0.001537 0.021584 0.005226 0.037911 -0.012261 0.001587 0.038184 0.033192 0.019179 0.053730 0.109975 0.093249 0.109174
1716.lowfreq: -3.4094 -0.0032 0.0040 0.0046 3.3609 4.4141 15.5102 20.2328 30.2658
redmass: 5.5236 4.8848 3.8326 5.2714 4.9397 3.9136 4.5159 4.5210 3.5575 5.9420 3.5388 1.1547 4.3781 3.4327 3.5747 1.2155 1.9151 3.1670 1.4172 3.0044 3.9902 3.1668 3.3275 1.1626 1.4369 2.7501 3.1137 1.9209 3.6396 4.2773 2.7726 4.0620 2.0298 1.5049 2.9052 1.5399 2.6622 3.3833 2.8183 4.6510 2.9203 1.9683 2.8572 3.8785 2.5486 2.8224 3.2460 1.7162 3.0404 2.1940 2.2743 2.1349 2.9765 1.5141 4.0377 4.9470 4.2404 3.7838 6.0453 1.5836 2.5925 3.8083 4.0638 3.7241 2.9967 2.9934 2.7450 3.7181 3.8282 3.5084 3.6646 4.0795 4.1697 3.8032 4.7402 6.1888 4.7762 4.1005 4.2749 3.9237 4.8763 3.3573 2.5419 3.5178 3.8784 4.6240 4.0510 2.8471 3.7170 6.3685 6.3635 6.5146 6.0157 5.6950 6.0089 1.9753 1.5730 3.1816 3.4170 2.6974 2.8111 2.3559 2.0549 3.3879 4.1248 2.9545 2.3432 2.2994 3.3197 1.2599 1.2560 2.8286 1.7793 2.7617 1.8800 1.7086 2.2508 1.9225 1.6901 1.4570 1.2336 1.4900 5.5043 1.5363 1.4213 1.4344 3.2587 1.5384 5.6422 4.3493 1.4237 1.4325 1.4643 1.7746 1.8559 1.4429 1.6936 1.5195 1.4971 1.6317 1.5348 1.5761 2.3718 1.8750 2.0506 2.1379 2.7732 1.9550 1.8908 1.8291 1.7496 1.5111 1.8033 1.8476 1.6928 1.8877 1.9838 2.3224 1.1321 1.1153 1.2101 1.8347 3.5991 3.3958 1.9880 1.1574 1.1958 2.3931 2.5148 2.4685 2.8910 4.6867 1.4922 1.7757 1.4175 2.7485 1.4832 1.2829 4.1401 2.6931 1.3626 1.4454 5.0629 1.2855 1.2668 1.2924 1.2784 1.2565 4.4952 1.2594 1.1076 1.3574 1.2024 1.3281 1.1421 1.1426 1.0930 1.2613 1.0490 1.0483 1.0904 1.0625 1.0668 1.1716 1.3053 1.1059 1.2801 1.3991 1.9174 1.2319 1.5305 2.3252 1.5080 1.6352 1.3608 2.4660 2.6888 1.1484 2.2861 3.5232 5.4152 2.6148 4.4059 6.3936 5.7796 6.5494 6.1036 5.9090 6.6631 6.0437 7.8700 12.4963 1.0506 1.0445 1.0475 1.0424 1.0392 1.0396 1.0425 1.0368 1.0345 1.0513 1.0944 1.1003 1.0953 1.0956 1.1012 1.0965 1.0938 1.1016 1.1023 1.1039 1.1072 1.1017 1.1042 1.0828 1.1028 1.0867 1.1060 1.0875 1.0906 1.0986 1.1059 1.0917 1.0890 1.0945 1.0969 1.0929 1.0961 1.0965 1.0964 1.0952 1.1003 1.0961 1.0928 1.0925 1.0980 1.0668 1.0655
irintensity: 0.6952 0.0459 0.2051 0.6319 0.6266 0.7959 3.5114 0.0566 2.1201 4.2105 3.8482 0.5357 0.9150 2.1938 0.0803 0.4248 0.2456 2.6300 0.5060 0.5342 0.5028 1.6852 2.8556 0.5834 1.1288 0.7885 3.9506 0.5913 0.3978 1.5507 0.4654 1.0457 3.4210 0.8235 3.3276 1.5646 3.9647 7.1533 5.2124 4.8226 3.5518 4.3946 0.4389 1.3622 0.3904 0.6334 5.6503 1.2093 3.0467 4.0435 25.0770 13.5843 20.0429 142.2890 2.7691 9.2756 40.5616 14.7224 2.5048 31.4040 15.1951 7.9779 6.5282 18.8137 0.6674 2.9021 2.3985 1.6177 2.4721 34.9740 8.6821 15.6609 0.9328 22.3389 12.5331 8.4471 2.3506 0.9403 1.5335 1.5271 11.8456 8.0977 0.2785 1.8927 0.7035 1.5698 1.0865 9.0459 8.0270 0.5804 0.3684 44.6331 29.5091 59.9746 87.5680 19.7857 60.8245 75.5895 5.4635 33.9484 138.5510 9.5518 58.8514 61.1730 40.3525 1.0830 0.9505 1.2304 57.4704 0.1937 0.0726 21.8126 6.1800 23.5665 18.3162 20.9456 26.8562 13.0568 3.6907 1.7239 1.0326 0.0032 26.0016 0.4426 6.7379 2.1874 37.5100 2.7902 1.4261 2.8659 2.9788 18.4573 2.1935 25.4368 6.9739 9.5686 8.3092 5.8915 3.8994 1.7971 1.3800 1.0205 3.7912 13.5597 13.5536 1.4836 13.0162 3.2769 18.5573 5.6312 13.7857 6.7332 7.1917 3.4277 6.2645 10.2133 186.8238 103.0965 7.6382 4.1070 10.2743 20.8656 0.7822 0.7501 5.6817 24.2343 2.5305 12.6807 22.8227 29.5602 1.6708 181.7050 9.7087 35.0457 14.6910 218.1195 29.1354 7.7238 10.6771 21.1185 4.4175 2.4524 9.5986 6.8167 9.4759 21.7600 23.7706 12.5699 3.4515 38.1073 46.0469 0.7376 4.2533 1.3703 0.9053 12.4693 7.1898 0.8866 0.7802 19.0423 7.7360 8.0949 1.3502 5.2943 12.6392 2.3339 10.7325 3.9034 22.8908 0.9392 11.1532 3.7229 27.0791 27.7272 18.2207 20.5019 4.6951 21.9366 1.4670 4.3367 254.1605 25.4785 15.7022 129.4162 15.6075 8.2350 1.1219 67.9049 29.1402 4.4841 66.3540 218.8812 29.3238 6.6235 15.4777 8.2429 11.2682 5.8492 15.0827 0.0056 4.5326 22.1548 27.0582 0.9383 8.7335 2.2812 0.2445 15.3521 7.6464 2.2083 10.2128 2.7024 0.4515 4.3635 6.6773 11.6156 2.4404 0.9737 1.9189 0.0203 4.2836 5.0305 0.8976 4.4839 0.2793 11.9781 6.7534 2.0777 3.9542 1.4280 0.4454 4.4963 0.3735 1.7395 1.6698 3.6757 13.3583 36.7585 33.0642
temp: 353.150 k
press: 1.00000 atm
elementType: 6 6 6 6 6 6 6 6 7 1 1 1 1 1 6 1 1 1 6 6 8 8 1 6 8 27 8 6 8 6 1 1 1 6 6 6 6 6 6 8 1 6 1 1 1 6 1 1 1 6 1 1 1 6 1 1 1 6 1 1 1 6 6 6 6 6 6 1 1 1 1 1 6 6 6 6 6 6 1 1 1 1 1 6 1 1 1 6 1 1 1 6 1 1 1
symmnumber: 1
zpe: 2070189.7 jmol-1
zpe.correction: 0.788494 hartree
zpe.thermalcorrener: 0.855594 hartree
zpe.thermalcorrenthalpy: 0.856712 hartree
zpe.thermalcorrgfe: 0.684105 hartree
zpe.sumelectzpe: -3439.095778 hartree
zpe.sumelectthermal: -3439.028678 hartree
zpe.sumelectthermalent: -3439.027559 hartree
zpe.sumelectthermalfe: -3439.200167 hartree
dipole: 1.3344 4.5091 -5.0427
dipole: 6.8951
quadrupole: -207.0086 -226.1867 -258.6172
quadrupole: -8.6931 -2.2953 -12.6417
quadrupole: 23.5956 4.4175 -28.0130 -8.6931 -2.2953 -12.6417
hfenergy: -3439.8842718 hartree
pointgroup: C01 [X(C40H47Co1N1O6)]
dipole: 0.5250094 1.7740296 -1.9839688 debye
polarizability: 512.6944435|-16.4742996|497.06958|-24.5370353|1.0309223|412.1751338 unknown
InChI: InChI=1S/C28H29NO4.C10H15.C2H3O2.Co/c1-25(2,3)28(32,33)26(19-29(4)23-18-12-11-17-22(23)26)27(31,21-15-9-6-10-16-21)24(30)20-13-7-5-8-14-20;1-6-7(2)9(4)10(5)8(6)3;1-2(3)4;/h5-19,31-32H,1-4H3;1-5H3;1H3;/q-1;;-2;+3
charge 1 multiplicity 1
95 atoms
C  -3.03309121 2.82554379 0.97213685
C  -2.08279714 2.37469028 0.05280613
C  -1.77845538 3.22950913 -1.02421863
C  -2.31001782 4.49984037 -1.20328137
C  -3.23387364 4.93666862 -0.24766038
C  -3.59428375 4.10124224 0.81459228
C  -1.26334262 1.09096905 -0.10802193
C  -0.59645236 1.37324682 -1.41643546
N  -0.87830743 2.54831078 -1.89211063
H  -3.34713556 2.19805502 1.79974728
H  -2.03371701 5.12974749 -2.0497307
H  -3.68259948 5.92725927 -0.34196164
H  -4.3317972 4.44651692 1.54191336
H  0.07853023 0.68780404 -1.91781614
C  -0.3852452 3.12544081 -3.13340292
H  0.24224082 4.00033348 -2.91160387
H  0.20241225 2.37661801 -3.67426602
H  -1.23881832 3.43751526 -3.75095878
C  -2.19540059 -0.16478111 -0.44217414
C  -3.25788353 -0.46193433 0.64748903
O  -3.13515973 0.01436613 1.76046947
O  -2.89375723 0.22097112 -1.64019966
H  -3.55797301 0.88749007 -1.41245885
C  0.11211593 0.83938992 2.41425194
O  0.93584289 0.14884187 0.20616769
Co 2.79338041 -0.36478361 0.10290254
O  2.18985255 -2.23490425 -0.34700042
C  2.33286846 -2.54117616 0.87255634
O  2.72364508 -1.60849281 1.64756466
C  2.08633491 -3.91772376 1.40456787
H  2.92654124 -4.21527556 2.04857941
H  1.1816979 -3.90348913 2.03047362
H  1.95314928 -4.6344311 0.58665388
C  3.94385077 -0.13910312 -1.61603679
C  4.70140752 -0.73635817 -0.53866741
C  4.76976658 0.21439984 0.52997688
C  4.00626752 1.36227841 0.15796225
C  3.51109034 1.14236394 -1.18364939
C  0.19012381 1.03641438 0.84684427
O  0.6845661 2.37585834 0.60341755
H  0.30012089 2.97314528 1.25993474
C  5.43622084 -0.02854456 1.84250455
H  6.52327715 -0.14101994 1.70164852
H  5.26447493 0.79552823 2.54584735
H  5.05396991 -0.9524552 2.30182479
C  3.8838951 2.64323009 0.91345853
H  4.10191752 2.51065158 1.98021535
H  4.60190647 3.37920474 0.51226865
H  2.87174395 3.05170877 0.81821339
C  2.73169631 2.14491923 -1.96378197
H  1.9678194 2.61123338 -1.32931096
H  3.405613 2.9368722 -2.33242142
H  2.25434472 1.68678297 -2.83971226
C  3.61523498 -0.83115106 -2.89728593
H  2.92996876 -0.23987663 -3.51877305
H  4.53196883 -1.01374213 -3.48102721
H  3.14257135 -1.80468753 -2.69570938
C  5.34504075 -2.08370975 -0.56186303
H  4.75787681 -2.79618161 -1.15628876
H  6.35418465 -2.0223685 -1.00340659
H  5.45253902 -2.4908723 0.45305033
C  -1.45636923 -1.45670596 -0.7920488
C  -1.02345979 -1.68217172 -2.10688014
C  -1.32948757 -2.49131993 0.14102114
C  -0.45667845 -2.90309815 -2.47266227
C  -0.79356102 -3.72381753 -0.23288744
C  -0.34385905 -3.93247829 -1.53649665
H  -1.18337948 -0.91908938 -2.86874232
H  -1.68518871 -2.35877487 1.16132089
H  -0.12553467 -3.05898935 -3.50193346
H  -0.7422168 -4.53059834 0.50024655
H  0.07836986 -4.89684243 -1.82710489
C  -4.43617156 -1.31403456 0.31080684
C  -5.4287635 -1.42416683 1.30505546
C  -4.59770637 -2.02116452 -0.89725919
C  -6.55592051 -2.21380454 1.09918239
C  -5.72599163 -2.81528193 -1.09598836
C  -6.70633693 -2.91274031 -0.10375434
H  -5.28924283 -0.88030238 2.24009495
H  -3.84597629 -1.95471806 -1.67896091
H  -7.31886416 -2.28927495 1.87688585
H  -5.8401523 -3.36437769 -2.03299018
H  -7.58862153 -3.53601014 -0.26723854
C  -0.23859046 -0.60553188 2.78186054
H  -1.27563124 -0.84038744 2.53123819
H  0.435822 -1.30531192 2.28161976
H  -0.12542148 -0.74116939 3.86836788
C  -0.86611174 1.78740309 3.12430873
H  -0.68544633 1.74101812 4.20893276
H  -0.74035508 2.84606273 2.83700936
H  -1.90325133 1.49618513 2.94963465
C  1.52287542 1.14239636 2.97296867
H  2.29287184 0.54264172 2.47917973
H  1.78442996 2.20445473 2.87871934
H  1.53953725 0.88890304 4.04326995
