program: Gaussian 09
title: 000033847
version: EM64L-G09RevD.01
frameworkgroup: C1[X(C17H22N4)]
method: RPBEPBE
basis: SDD
operation: Freq
keyword: #pfreq=noraman
keyword: PBEPBE/SDD
title: #p freq=noraman PBEPBE/SDD
converged: YES YES NO NO
title: Mulliken charges:
elementType: N N N N C C C C C C C C C C C C C C C C C H H H H H H H H H H H H H H H H H H H H H H
charge: -0.079149 -0.125981 -0.114963 -0.047548 -0.360101 -0.356543 -0.441211 -0.447633 -0.381383 -0.440118 -0.516938 0.228293 0.185557 -0.307887 -0.305327 -0.194554 -0.360134 -0.216801 -0.187378 -0.361621 -0.182905 0.177345 0.226564 0.223493 0.185455 0.205056 0.228218 0.224113 0.212675 0.186453 0.240767 0.227716 0.274585 0.257876 0.230778 0.246296 0.278606 0.229678 0.229764 0.226925 0.236505 0.235940 0.229521
chargesum: 0.00000
title: Mulliken charges with hydrogens summed into heavy atoms:
elementType: N N N N C C C C C C C C C C C C C C C C C
charge: -0.079149 -0.125981 -0.114963 -0.047548 0.043807 0.052405 -0.007938 -0.010846 0.045837 0.062183 -0.028285 0.228293 0.185557 -0.061591 -0.026721 0.035124 -0.130371 0.010124 0.049126 -0.125681 0.046616
polarizability: 2.31855220e+02 -1.61969893e+01 2.58712218e+02 2.07829861e+00 -1.07662386e+00 1.37434171e+02
1716.lowfreq: -9.1438 -4.0175 -2.0728 -0.0008 0.0003 0.0005 16.9083 20.3985 25.3675
frequency: 16.6867 20.3459 25.3552 36.2792 45.4407 49.7095 63.7459 99.1596 109.7756 134.3867 162.8406 204.7998 220.5238 228.0533 307.0047 327.1511 336.0447 389.4681 402.1489 405.0087 418.7100 451.8464 516.1063 533.8917 543.9466 602.7327 619.8552 622.0374 630.1440 646.4506 734.1567 745.0497 756.5892 767.4992 768.5296 784.4006 806.0135 832.0244 848.6380 852.4928 860.8584 899.5885 911.5695 923.7739 942.9018 944.3299 959.2092 962.4266 965.5212 968.1500 978.7703 998.8359 1008.3352 1036.3883 1038.4248 1040.9188 1064.2919 1079.4649 1088.3951 1094.1864 1096.5639 1138.9405 1145.4358 1161.7256 1165.4140 1174.3857 1191.5644 1196.5841 1220.3962 1234.3060 1238.4028 1238.5753 1244.6960 1280.4039 1290.2443 1293.8625 1298.2229 1303.3184 1314.1262 1325.9862 1333.9939 1339.7825 1350.7145 1357.0193 1385.8206 1392.6495 1417.7275 1426.8033 1444.1700 1455.4274 1463.9056 1465.9751 1479.5094 1480.3787 1484.3538 1497.7812 1508.9584 1547.9633 1562.6125 1582.1691 1598.3524 2830.8841 2839.6945 2854.2123 3001.5488 3011.9601 3021.6228 3022.7365 3023.5639 3035.6518 3043.9956 3064.0207 3068.1025 3092.7841 3098.0728 3117.6925 3125.0862 3134.2171 3137.7811 3156.9102 3166.3485 3169.2349 3176.7982
redmass: 3.6762 4.4774 2.5687 4.3354 3.9043 2.2502 3.4261 3.3498 4.1755 4.3099 4.3051 4.4909 3.5754 2.8293 2.8725 3.6091 2.4210 3.6312 2.2487 3.0351 3.3843 3.5566 2.8285 3.8484 4.7912 4.6520 6.4798 3.5891 3.4727 3.6177 1.7764 3.0653 1.6514 1.6475 2.3125 2.2151 1.4292 3.4949 1.8198 1.3511 2.2821 2.6104 1.3232 2.4105 1.4164 5.8072 2.2131 2.4152 2.0586 1.6901 1.3190 2.6755 1.3340 3.6557 2.3363 2.3177 2.4913 1.8910 1.7447 1.6020 1.8599 2.1701 2.1590 1.0767 1.7838 1.1998 1.4226 1.3237 1.5906 2.4496 1.6896 1.4719 1.3233 1.1999 1.2940 2.0621 1.2909 1.4998 1.6166 2.1394 4.1565 1.4534 1.3939 1.3207 1.5392 1.6774 1.9848 1.9856 1.2332 2.1383 1.0941 1.1152 1.1479 1.0815 1.5315 1.1344 1.3854 5.3111 5.9274 5.6837 5.8162 1.0711 1.0717 1.0705 1.0605 1.0596 1.0847 1.0615 1.0688 1.0860 1.0872 1.1040 1.1044 1.1054 1.1022 1.0892 1.0878 1.0888 1.0897 1.0949 1.0931 1.1017 1.1000
irintensity: 0.1654 0.8276 0.7093 0.4097 2.6089 0.1656 1.8038 0.3595 1.6240 3.6831 0.3141 1.4930 2.8998 1.9000 3.8888 3.4842 5.4300 17.7641 8.4091 4.8919 1.4365 1.3647 7.7570 11.4249 6.3955 10.1149 0.5929 0.6277 3.6117 7.8144 25.9293 0.7466 33.6602 0.3018 72.0149 18.6822 2.8156 13.6026 7.4664 0.5855 10.7275 7.5833 1.4191 19.5956 0.7909 7.6377 2.8114 10.1432 15.2492 0.0828 0.2636 7.7459 1.4060 6.2266 9.1089 10.3486 2.9028 2.6602 2.4217 1.4622 30.9572 31.6850 48.5069 0.8062 1.0492 15.7860 7.2408 6.9637 27.9089 9.4774 18.9617 8.1312 5.8290 8.8748 7.7699 0.3793 13.1393 17.1118 7.7848 11.8151 29.5049 3.6859 1.7761 13.6413 5.6125 8.3055 25.1844 21.9644 59.6397 30.2010 10.4615 4.6606 43.7448 2.0006 101.5452 10.3811 83.1141 28.2887 20.5620 43.6335 333.6266 44.1103 63.8098 184.6984 21.5867 20.5331 7.8892 32.6255 81.6885 68.8455 12.3956 16.7699 3.5806 74.4238 6.0463 29.8293 12.4285 12.3286 13.8888 12.8298 27.4994 28.6743 14.4400
temp: 298.150 k
press: 1.00000 atm
elementType: 7 7 7 7 6 6 6 6 6 6 6 6 6 6 6 6 6 6 6 6 6 1 1 1 1 1 1 1 1 1 1 1 1 1 1 1 1 1 1 1 1 1 1
symmnumber: 1
zpe: 951949.5 jmol-1
zpe.correction: 0.362578 hartree
zpe.thermalcorrener: 0.381860 hartree
zpe.thermalcorrenthalpy: 0.382804 hartree
zpe.thermalcorrgfe: 0.310244 hartree
zpe.sumelectzpe: -878.432731 hartree
zpe.sumelectthermal: -878.413450 hartree
zpe.sumelectthermalent: -878.412505 hartree
zpe.sumelectthermalfe: -878.485065 hartree
dipole: 0.4667 -0.3366 -0.9719
dipole: 1.1294
quadrupole: -110.8769 -116.4111 -127.2772
quadrupole: 2.5733 5.2087 1.5946
quadrupole: 7.3115 1.7773 -9.0888 2.5733 5.2087 1.5946
hfenergy: -878.7953093 hartree
pointgroup: C01 [X(C17H22N4)]
dipole: -0.1342314 0.0763136 -0.4166668 debye
polarizability: 229.4429919|-13.1076255|257.1795715|10.0014424|-19.9438888|141.3790454 unknown
InChI: InChI=1S/C17H22N4/c1-3-9-18-16(7-1)15-21(17-8-2-4-10-19-17)14-13-20-11-5-6-12-20/h1-4,7-10H,5-6,11-15H2
charge 0 multiplicity 1
43 atoms
N  -3.423371 0.174438 -0.390504
N  0.227609 -0.285476 0.588822
N  1.871997 -1.845871 1.247581
N  1.278398 2.84088 0.195027
C  -4.740374 -0.270299 0.136881
C  -3.608892 1.615835 -0.717061
C  -5.747279 0.371414 -0.845158
C  -5.047245 1.695581 -1.304804
C  -2.282207 -0.130764 0.490484
C  -0.929966 0.146031 -0.214225
C  0.89331 0.742883 1.424139
C  0.714605 -1.588423 0.543752
C  1.809734 1.645073 0.607343
C  0.051307 -2.625199 -0.196694
C  3.13013 1.245023 0.275326
C  0.604404 -3.915867 -0.198416
C  2.372769 -3.111377 1.236974
C  1.790735 -4.184889 0.531543
C  3.934196 2.111036 -0.495562
C  2.068478 3.665406 -0.555794
C  3.396009 3.34922 -0.920815
H  -4.918149 0.108855 1.17682
H  -4.796752 -1.373352 0.16292
H  -2.839137 1.962359 -1.428209
H  -3.528639 2.248928 0.204111
H  -6.727272 0.551467 -0.370067
H  -5.904827 -0.295486 -1.70993
H  -5.022582 1.758488 -2.405878
H  -5.572961 2.592089 -0.93241
H  -2.31962 0.454495 1.447429
H  -2.332015 -1.20147 0.764147
H  -0.931008 -0.354815 -1.199733
H  -0.814421 1.228248 -0.402881
H  1.469612 0.217875 2.201734
H  0.115716 1.372685 1.891525
H  -0.872383 -2.426372 -0.745688
H  3.488818 0.27004 0.620076
H  0.107687 -4.713976 -0.761724
H  3.289502 -3.257246 1.821776
H  2.242705 -5.180222 0.552422
H  4.959637 1.830004 -0.759266
H  1.610773 4.611864 -0.867155
H  3.986269 4.051887 -1.517858
