program: Gaussian 16
title: Title Card Required
version: ES64L-G16RevC.01
frameworkgroup: C1[X(C33H45LiN2O6)]
method: RM062X
basis: Gen
operation: Freq
keyword: #p
keyword: freq=noraman
keyword: gen
keyword: scrf=(smd,solvent=thf)
keyword: integral=grid=ultrafine
keyword: m062x
title: #p freq=noraman gen scrf=(smd,solvent=thf) integral=grid=ultrafine m06
basis: NPDir=0 NMtPBC= 1 NCelOv= 1 NCel= 1 NClECP= 1 NCelD= 1
basis: NCelK= 1 NCelE2= 1 NClLst= 1 CellRange= 0.0.
basis: One-electron integrals computed using PRISM.
basis: One-electron integral symmetry used in STVInt
basis: NBasis= 837 RedAO= T EigKep= 2.06D-04 NBF= 837
basis: NBsUse= 837 1.00D-06 EigRej= -1.00D+00 NBFU= 837
converged: YES YES NO NO
title: Mulliken charges:
elementType: Li C O C C C H H H H H H H H C O C C C H H H H H H H H C O C C C H H H H H H H H C O C C C H H H H H H H H C C C C C C C C C C C H C C C H H H H H H O O N N C C H H H C H H H
charge: -0.009015 0.016499 -0.444544 0.042605 -0.267881 -0.282762 0.158664 0.145320 0.122913 0.146667 0.145323 0.162766 0.149633 0.153046 0.023228 -0.501282 0.018075 -0.281760 -0.257785 0.115082 0.161667 0.162696 0.164138 0.146693 0.138657 0.140902 0.140846 0.004605 -0.456266 0.044615 -0.278880 -0.284482 0.145644 0.157335 0.139492 0.142302 0.153929 0.148118 0.148095 0.145246 -0.001460 -0.414179 0.023708 -0.274558 -0.286982 0.151244 0.167323 0.138653 0.146085 0.151261 0.153701 0.157125 0.148688 -0.142468 0.152119 0.000732 -0.020313 -0.214200 -0.153542 0.374479 0.404813 -0.005756 0.004778 -0.169415 0.168973 -0.129345 -0.149980 -0.152573 0.130180 0.153335 0.136504 0.153237 0.154786 0.175212 -0.621177 -0.670044 -0.379473 -0.284683 0.186197 -0.392417 0.150869 0.150124 0.115702 -0.410860 0.137955 0.134415 0.131079
chargesum: -0.00000
title: Mulliken charges with hydrogens summed into heavy atoms:
elementType: Li C O C C C C O C C C C O C C C C O C C C C C C C C C C C C C C C C C O O N N C C C
charge: -0.009015 0.320483 -0.444544 0.312185 0.040209 0.019917 0.299977 -0.501282 0.344909 0.003591 0.023963 0.307584 -0.456266 0.326409 0.023166 0.008859 0.317107 -0.414179 0.308447 0.030404 0.018831 -0.012289 0.152119 0.000732 -0.020313 -0.060865 -0.017037 0.374479 0.404813 -0.005756 0.004778 -0.000441 0.023892 0.004806 0.022640 -0.621177 -0.670044 -0.379473 -0.284683 0.186197 0.024278 -0.007410
chargesum: -0.00001
polarizability: 5.38419997e+02 1.65528352e+02 6.01059627e+02 -4.88494916e+01 4.36296251e+01 5.57476679e+02
1716.lowfreq: -17.9391 -0.0007 -0.0004 0.0005 2.7116 9.6678 18.0221 28.0593 33.6076
frequency: 15.2019 27.5956 33.4520 37.1701 43.1207 44.2657 46.2525 50.1221 53.2117 57.4242 61.7354 65.3652 71.5026 72.8484 78.4480 86.0113 88.7870 93.0116 96.0035 100.4119 102.2884 109.1004 114.8479 122.4374 128.9502 133.7121 143.0252 144.0999 148.4150 159.4605 164.2724 171.2949 182.4470 196.9521 201.4339 202.6801 210.3458 215.2808 217.2900 251.2678 265.7277 280.9252 290.7927 294.2080 296.1810 323.9387 350.2038 371.1646 378.6645 404.5196 413.7835 433.9097 438.2848 463.9148 474.2094 487.6164 492.5666 502.5383 520.3994 523.3865 568.7837 578.6579 579.6959 582.4527 589.4504 619.4352 627.4915 644.2521 679.4656 684.2436 691.8142 691.9687 701.7860 705.9007 715.1246 724.8347 752.4789 790.7260 794.4445 796.7219 821.7706 845.7002 856.2289 857.9491 860.4129 865.9437 878.9016 887.8956 890.2712 894.1947 897.4365 918.7285 919.3794 921.1774 922.8278 927.6104 928.2617 930.9359 934.4285 935.8142 940.0608 950.7232 951.8023 952.7932 961.5354 962.3898 965.9210 974.0488 976.6533 978.0354 981.0733 981.9197 1008.9700 1024.4247 1029.0096 1035.7729 1052.0269 1055.5264 1058.7698 1066.4059 1069.3697 1076.4678 1097.5936 1098.1674 1098.9236 1108.0475 1113.0239 1114.9248 1128.6505 1151.0869 1152.1770 1164.7530 1166.0029 1166.9862 1168.1780 1177.3127 1183.6269 1199.0435 1199.8286 1203.1880 1204.7202 1211.5924 1213.0599 1218.6812 1223.5655 1238.8975 1248.0679 1254.0181 1265.6333 1269.4329 1270.6598 1273.4170 1273.9362 1278.5197 1281.3481 1291.5479 1300.7521 1314.7161 1320.5195 1321.8830 1323.5996 1324.6842 1336.5672 1350.7669 1354.0099 1357.4683 1367.6906 1376.2799 1378.7045 1382.2741 1383.7836 1401.0697 1408.1673 1408.8492 1409.5246 1413.3244 1414.5566 1422.9770 1433.5561 1462.6918 1478.0276 1480.2494 1480.4645 1481.3580 1481.4883 1482.5890 1483.6214 1487.3875 1492.6084 1493.7638 1496.0482 1500.4347 1501.8332 1508.2899 1512.6851 1514.3012 1522.4642 1523.7586 1528.9006 1529.7646 1530.0023 1530.9651 1535.6014 1582.2999 1660.9127 1677.8963 1678.4025 1706.7163 1733.8573 1768.8562 3055.7456 3057.1609 3062.8277 3071.5812 3071.8505 3076.7621 3079.5333 3082.3276 3084.4505 3087.3355 3088.0683 3089.2904 3098.3356 3099.0558 3100.9203 3101.3667 3104.1637 3114.0911 3114.8415 3136.8079 3137.3616 3139.3146 3141.9855 3144.5129 3146.0617 3148.0722 3149.7972 3155.1479 3159.0003 3164.7834 3166.2648 3166.5690 3167.1714 3169.1346 3171.9329 3172.2763 3173.2782 3173.8394 3208.2882 3217.3340 3231.7847 3243.0026 3246.5844 3253.5639 3266.8409
redmass: 4.5810 4.7076 4.2042 4.2312 4.2293 3.7773 4.6071 5.0256 3.9958 3.6408 3.7863 4.4278 3.1090 4.8643 5.1757 4.1228 3.0611 3.0533 4.2422 3.7945 4.3103 3.2894 3.2626 4.0689 3.5757 3.9039 4.7380 4.2612 2.6629 2.0979 2.8015 3.9280 3.6128 2.5346 2.2891 2.4642 1.7819 1.3842 4.1414 4.4647 3.6897 1.6954 1.7113 1.7919 4.6862 1.9291 6.4596 4.8897 4.4883 3.4181 10.1784 3.6102 4.6942 6.8009 6.4483 7.4611 3.9165 6.3669 6.2876 4.0179 4.6661 1.7423 1.7564 1.7479 5.7951 1.9154 6.0669 6.4292 4.3439 3.0337 5.8318 3.2117 2.7212 6.3632 4.2254 2.7824 2.1848 2.5741 5.8532 1.3010 2.1567 2.3316 1.5682 1.6015 3.4022 1.6894 1.6959 1.9688 2.0261 1.9743 5.3348 2.3868 3.0421 2.5734 2.4639 1.6040 1.4608 2.6289 1.5730 2.2398 2.5076 2.3658 2.5019 2.3352 1.2699 1.8644 3.0027 1.5642 1.6039 1.5444 1.3785 1.4793 1.3718 4.6701 1.3121 1.3162 1.5636 1.5994 1.6062 1.8902 2.0561 2.0871 1.7431 1.8869 6.0541 6.9050 6.9291 2.2212 5.1910 1.9894 3.3018 1.3195 1.6348 1.7789 1.7955 1.6895 1.4044 1.3023 1.4679 1.3300 1.5054 1.4960 1.4158 1.3953 1.9367 1.1879 1.2494 2.2124 1.1730 1.1726 1.1612 1.1771 1.2041 1.2169 2.1955 1.2106 2.9311 1.3486 1.3886 1.3771 1.3717 1.3069 2.6801 1.3780 1.3673 1.3524 7.9407 1.3430 1.3651 1.3486 1.3348 1.3889 1.5324 1.3836 1.5146 1.3658 1.3713 3.0134 3.4396 4.2667 1.0499 1.0724 1.0969 1.0797 1.0703 1.1006 1.0910 1.1471 1.1186 1.1142 1.1157 1.1853 2.4186 1.1041 1.1027 1.0953 3.3964 1.1852 1.1027 1.6934 1.3329 1.2344 1.1082 6.1565 8.1983 6.8211 6.7017 10.0943 9.1018 12.3371 1.0387 1.0677 1.0657 1.0364 1.0677 1.0655 1.0621 1.0682 1.0657 1.0613 1.0656 1.0609 1.0590 1.0643 1.0628 1.0641 1.0645 1.1006 1.0625 1.1000 1.1002 1.1062 1.1049 1.0988 1.1067 1.1069 1.1054 1.0984 1.1057 1.1030 1.1012 1.1042 1.0995 1.1068 1.1045 1.1058 1.1014 1.1017 1.0901 1.0883 1.0913 1.0947 1.0949 1.0918 1.0919
irintensity: 0.0514 0.5704 1.7945 0.7379 0.8623 1.8462 1.1170 1.2170 1.5157 1.1338 0.5528 2.8432 0.3120 17.3233 2.7407 1.4886 1.8460 1.1522 2.9747 1.2339 1.9975 1.6968 2.3244 2.1603 2.4126 4.5462 2.6015 3.5512 1.2378 6.0717 0.7792 1.3900 12.0432 2.5328 5.3445 1.4717 4.9835 0.8609 4.3095 1.7426 1.2765 0.5232 1.0588 7.7627 2.3972 8.5410 3.9659 18.8111 7.6048 5.0184 66.8864 1.1977 0.9837 32.4583 72.0488 4.3251 0.4107 116.0773 85.8930 0.9644 8.2529 0.4121 1.6457 0.5958 19.7610 5.9947 2.5739 3.0374 7.7176 3.1663 5.5669 34.5273 29.9640 2.4501 26.4157 38.4540 96.1439 10.5180 1.0745 8.6910 2.6725 53.6041 8.2928 5.7580 4.2057 10.1237 9.1563 10.7380 9.3183 7.5319 14.2073 1.1115 72.1234 13.8113 46.6332 5.8722 1.6016 1.4651 37.5709 58.9569 11.5737 15.7569 8.8233 10.6854 0.7332 2.1911 65.5832 5.8306 2.3923 1.7885 15.5709 0.3624 3.1405 267.3822 4.0932 0.5227 11.8979 3.6158 6.3298 11.6854 43.3706 16.7616 24.7971 173.3410 144.5240 167.8539 253.3243 3.2039 104.7425 18.1243 119.2700 14.6600 4.4442 1.7430 1.3089 151.7157 13.5853 12.2698 13.3943 18.4535 13.6613 11.7374 16.6283 15.2436 119.0086 9.7144 4.0609 93.8392 1.5288 3.5196 0.4917 24.1508 8.9453 36.0193 276.6337 13.9953 483.4845 6.3845 1.5529 0.0375 6.6230 2.5110 422.8942 3.4743 0.9367 1.3577 4.4757 2.8399 5.6478 2.2881 1.7284 146.4705 16.6700 7.2175 33.5201 4.3241 1.8405 43.7129 562.7900 197.9846 1.8902 20.2820 5.1416 2.7309 11.9590 5.6806 5.1738 79.5294 4.8244 6.8885 8.9168 29.1783 21.0283 7.2309 3.0064 0.3569 528.4497 88.0067 1.1433 15.4840 0.3420 4.4294 9.4020 229.2320 119.6201 136.6830 320.0737 322.5737 143.9082 457.2899 73.3118 84.8235 69.7485 52.0766 58.3631 30.3447 35.5015 20.8792 22.6791 40.7876 22.8797 35.8707 34.6497 29.1917 23.3849 25.4961 24.6810 27.6715 22.2479 16.6215 42.4129 20.3917 24.7586 29.0199 39.4984 22.5606 16.2850 24.4715 3.0564 26.9308 18.3371 32.2534 5.8425 65.1764 30.1268 38.0939 14.5546 20.1455 44.7884 6.0708 5.9881 4.5818 14.5457 0.3309 3.2001
temp: 298.150 k
press: 1.00000 atm
elementType: 3 6 8 6 6 6 1 1 1 1 1 1 1 1 6 8 6 6 6 1 1 1 1 1 1 1 1 6 8 6 6 6 1 1 1 1 1 1 1 1 6 8 6 6 6 1 1 1 1 1 1 1 1 6 6 6 6 6 6 6 6 6 6 6 1 6 6 6 1 1 1 1 1 1 8 8 7 7 6 6 1 1 1 6 1 1 1
symmnumber: 1
zpe: 1958112.1 jmol-1
zpe.correction: 0.745805 hartree
zpe.thermalcorrener: 0.789012 hartree
zpe.thermalcorrenthalpy: 0.789957 hartree
zpe.thermalcorrgfe: 0.666284 hartree
zpe.sumelectzpe: -1851.571848 hartree
zpe.sumelectthermal: -1851.528641 hartree
zpe.sumelectthermalent: -1851.527697 hartree
zpe.sumelectthermalfe: -1851.651369 hartree
dipole: 20.0036 -6.8249 2.0171
dipole: 21.2319
quadrupole: -233.0769 -234.8831 -235.2283
quadrupole: 4.6957 -10.1110 -9.8278
quadrupole: 1.3192 -0.4870 -0.8322 4.6957 -10.1110 -9.8278
hfenergy: -1852.3176532 hartree
pointgroup: C01 [X(C33H45Li1N2O6)]
dipole: 7.8700296 -2.6851156 0.7936023 debye
polarizability: 538.4200333|165.5283587|601.0595907|-48.8494868|43.6296305|557.4766794 unknown
InChI: InChI=1S/C17H13N2O2.4C4H8O.Li/c1-10(2)18-19-14-9-5-8-13-15(14)17(21)12-7-4-3-6-11(12)16(13)20;4*1-2-4-5-3-1;/h3-9H,1-2H3;4*1-4H2;
charge 0 multiplicity 1
87 atoms
Li 1.895734 -1.389031 0.551309
C  2.454327 -0.080719 3.161329
O  1.527673 -0.392066 2.10414
C  0.484234 0.606446 2.037739
C  0.93586 1.725174 2.9689
C  1.741552 0.955516 4.01871
H  2.694696 -1.008013 3.686998
H  3.372285 0.330645 2.720644
H  0.371153 0.91494 0.993369
H  -0.454718 0.151212 2.375231
H  1.581044 2.431436 2.433207
H  0.089316 2.276722 3.382112
H  2.439938 1.581401 4.57687
H  1.068101 0.462377 4.726837
C  2.563185 1.276834 -0.555872
O  2.012019 -0.030172 -0.745311
C  1.77102 -0.205877 -2.150938
C  2.803322 0.682176 -2.872897
C  3.508913 1.454412 -1.737666
H  1.759337 2.022544 -0.568111
H  3.050377 1.295812 0.423901
H  1.882961 -1.272013 -2.365875
H  0.740298 0.096591 -2.373001
H  3.513017 0.086792 -3.451254
H  2.299583 1.364228 -3.561274
H  4.479072 1.002554 -1.509051
H  3.665839 2.508365 -1.977553
C  0.499615 -3.774253 0.963704
O  0.545627 -2.623188 0.091537
C  -0.782195 -2.057111 -0.047058
C  -1.55126 -2.58221 1.153936
C  -0.975329 -3.993101 1.28797
H  0.959926 -4.621205 0.448129
H  1.082422 -3.545177 1.865312
H  -0.687505 -0.967595 -0.088391
H  -1.220586 -2.404609 -0.98902
H  -1.317339 -1.986293 2.043937
H  -2.629551 -2.563013 0.986077
H  -1.115425 -4.431309 2.277853
H  -1.433089 -4.656007 0.546908
C  3.627963 -3.514264 -0.254913
O  3.534977 -2.355275 0.60912
C  4.673606 -1.500072 0.3912
C  5.164899 -1.858767 -1.000675
C  4.95097 -3.37377 -1.005457
H  3.575926 -4.412429 0.365678
H  2.769328 -3.496223 -0.935087
H  4.343572 -0.462837 0.493963
H  5.43209 -1.712993 1.154289
H  4.528989 -1.378904 -1.754081
H  6.201695 -1.562308 -1.170319
H  4.898242 -3.803043 -2.007348
H  5.757855 -3.868819 -0.456866
C  -3.863318 0.043302 1.470604
C  -3.268916 0.165988 0.151506
C  -2.358871 1.289331 -0.036396
C  -2.155681 2.203062 1.048935
C  -2.763407 2.038108 2.275422
C  -3.62032 0.9329 2.476317
C  -1.643804 1.490946 -1.283091
C  -1.242916 3.378755 0.94015
C  -0.457039 3.529549 -0.307955
C  -0.678872 2.649835 -1.372207
C  0.04116 2.831025 -2.557658
H  -0.14955 2.154766 -3.384223
C  0.981271 3.849712 -2.664645
C  1.218427 4.707484 -1.586197
C  0.492093 4.551616 -0.41285
H  -4.537885 -0.787616 1.629141
H  -2.573878 2.755952 3.064713
H  -4.099309 0.79489 3.442354
H  1.535281 3.978046 -3.590215
H  1.957779 5.497734 -1.669774
H  0.642956 5.213017 0.434187
O  -1.127288 4.196984 1.846662
O  -1.736976 0.775756 -2.287917
N  -3.528103 -0.686477 -0.836827
N  -4.353373 -1.725582 -0.450599
C  -4.786726 -2.458734 -1.413669
C  -4.480725 -2.208996 -2.866297
H  -4.815681 -1.210514 -3.165324
H  -3.399886 -2.230735 -3.040759
H  -4.962105 -2.954455 -3.503573
C  -5.654004 -3.635152 -1.072446
H  -6.632044 -3.552984 -1.561799
H  -5.201902 -4.568868 -1.42909
H  -5.801965 -3.701741 0.007268
