program: Gaussian 16
title: Title Card Required
version: ES64L-G16RevC.01
frameworkgroup: C1[X(C32H30LiN3O4)]
method: RM062X
basis: Gen
operation: Freq
keyword: #p
keyword: freq=noraman
keyword: gen
keyword: scrf=(smd,solvent=thf)
keyword: integral=grid=ultrafine
keyword: m062x
title: #p freq=noraman gen scrf=(smd,solvent=thf) integral=grid=ultrafine m06
basis: NPDir=0 NMtPBC= 1 NCelOv= 1 NCel= 1 NClECP= 1 NCelD= 1
basis: NCelK= 1 NCelE2= 1 NClLst= 1 CellRange= 0.0.
basis: One-electron integrals computed using PRISM.
basis: One-electron integral symmetry used in STVInt
basis: NBasis= 726 RedAO= T EigKep= 1.98D-04 NBF= 726
basis: NBsUse= 726 1.00D-06 EigRej= -1.00D+00 NBFU= 726
converged: YES YES NO NO
title: Mulliken charges:
elementType: Li C C C C C C C C C C C H C C C H H H H H H O O N N C H C C N C H C C H C O C C C H H H H H H H H C O C C C H H H H H H H H C C C C H H H H
charge: -0.019294 -0.131240 0.243080 0.000579 -0.026550 -0.197087 -0.143727 0.386273 0.429701 0.001885 0.004581 -0.159762 0.172687 -0.138527 -0.139489 -0.154333 0.154457 0.172326 0.154516 0.160481 0.161605 0.181601 -0.589438 -0.475997 -0.437673 -0.247908 0.059577 0.148381 0.199453 -0.138633 -0.510145 -0.120715 0.161281 0.154575 0.049016 0.162953 0.007606 -0.434429 0.010282 -0.284354 -0.275455 0.169996 0.137907 0.146714 0.154938 0.146237 0.148706 0.148443 0.151810 0.017642 -0.430614 0.012394 -0.274589 -0.276466 0.145442 0.154529 0.159762 0.140605 0.141630 0.147658 0.149067 0.144484 -0.133251 -0.157130 -0.152176 -0.149593 0.147378 0.153059 0.151307 0.151973
chargesum: -0.00000
title: Mulliken charges with hydrogens summed into heavy atoms:
elementType: Li C C C C C C C C C C C C C C O O N N C C C N C C C C O C C C C O C C C C C C C
charge: -0.019294 0.023217 0.243080 0.000579 -0.026550 -0.024760 0.010789 0.386273 0.429701 0.001885 0.004581 0.012925 0.021954 0.022116 0.027268 -0.589438 -0.475997 -0.437673 -0.247908 0.207958 0.199453 0.022647 -0.510145 0.042238 0.154575 0.049016 0.315509 -0.434429 0.311934 0.010589 0.024798 0.317613 -0.430614 0.312761 0.014698 0.017085 0.014126 -0.004071 -0.000869 0.002379
polarizability: 1.01005316e+03 -1.87153281e+01 5.93922489e+02 -3.49959247e+01 -8.80490433e+00 2.46699341e+02
1716.lowfreq: -3.2244 -0.0005 0.0008 0.0012 2.8336 3.7073 9.8227 13.2723 19.0720
frequency: 9.4326 13.1541 19.0505 24.3032 26.0591 33.8043 40.4319 44.5864 48.8939 54.8567 68.3250 74.2013 79.9097 92.4589 109.0278 116.4917 120.8424 125.0634 127.4014 135.4861 156.1298 170.0877 178.0043 179.8160 191.0860 203.8088 217.2309 240.0402 250.1779 276.5245 276.8695 300.5794 336.1907 358.0777 372.9669 384.3994 395.2485 408.9087 411.8438 430.5847 432.3890 452.7084 473.1411 484.6654 491.8024 493.0900 499.1096 524.8884 531.8080 558.6727 568.7765 573.8687 576.2631 577.4463 612.1372 630.3102 633.2005 668.6385 680.0438 683.7481 695.2479 698.1049 700.1965 721.4914 748.7840 753.4733 782.6671 787.1768 789.7814 798.4103 810.1294 818.9316 820.1434 843.9616 856.1381 863.7653 864.4352 887.1641 888.2669 903.6405 905.1536 925.2434 925.7199 927.8494 929.2729 930.2481 931.4918 936.5116 937.3802 949.6617 950.6690 955.5920 976.7494 981.2373 982.5657 994.9739 1011.8829 1023.2892 1027.0847 1029.2567 1039.8922 1042.3576 1052.6906 1054.9720 1055.7653 1076.7969 1096.2108 1112.6172 1115.6966 1119.6132 1135.5769 1158.0948 1163.0047 1166.0330 1170.4864 1170.8616 1171.8591 1189.8463 1198.1333 1199.8717 1201.1148 1207.0106 1212.1852 1224.9049 1238.8005 1268.4258 1268.6331 1272.0574 1272.1034 1273.8537 1275.3910 1289.5511 1304.7983 1321.9076 1322.9656 1334.7748 1355.7377 1356.3099 1359.8773 1363.8874 1372.4681 1381.0271 1385.5396 1397.7809 1411.6146 1416.4194 1419.4998 1436.4049 1443.4283 1458.5741 1475.5468 1480.1167 1484.8221 1495.7602 1496.8197 1498.9228 1507.1286 1521.9823 1523.0776 1527.5827 1531.9017 1533.7317 1538.2119 1573.0975 1595.9671 1649.0496 1661.3884 1676.1101 1679.3913 1688.6698 1691.0274 1709.0743 1714.1314 1785.4875 3067.7534 3074.3899 3075.0090 3079.7899 3095.9144 3097.3722 3100.5243 3104.6294 3134.9456 3137.2407 3142.2290 3143.6066 3144.6160 3163.3977 3165.5012 3170.0561 3172.2837 3216.3846 3220.6611 3221.3253 3224.6892 3227.9119 3234.8265 3238.8534 3243.2960 3246.1007 3250.5699 3255.3301 3259.0810 3274.8145
redmass: 4.6477 5.3669 5.3468 4.9413 5.3232 4.4278 4.5328 4.1504 3.3980 4.7721 3.6755 3.0444 4.5717 4.3087 3.6928 4.4636 4.3816 4.8686 5.8144 4.0151 5.6136 5.4070 4.1073 3.2547 4.9560 4.0352 4.5709 4.7865 5.1249 1.7618 1.7401 4.5073 7.7579 6.9386 5.4371 6.8001 9.0743 3.7121 10.3339 3.5251 5.0248 7.4269 6.2444 7.1163 3.3199 4.2910 5.7568 6.8607 6.9815 3.6651 4.5707 4.5837 1.8039 1.9096 8.2966 7.4113 6.9548 6.5208 4.3371 3.1259 6.0636 3.1823 3.0777 2.8650 5.4191 2.5113 1.3767 3.0535 5.3194 5.7142 3.5450 6.0773 2.0937 2.0802 1.5915 1.6266 1.4858 1.9950 1.9612 1.8254 4.3876 4.7947 2.5502 1.4567 1.5056 2.0653 4.9393 3.1008 1.4674 2.4170 2.3687 1.5890 1.4991 1.5472 3.3047 1.3336 1.3749 1.3188 1.3073 1.3178 1.3275 5.5789 1.5679 2.0726 1.5750 1.8916 2.2173 6.9949 6.9949 2.1447 1.4571 1.9743 1.1383 1.2488 1.6168 1.2185 1.8023 1.4816 2.4908 1.4684 1.3998 1.5036 1.4219 1.9113 1.9507 1.5286 1.3347 1.2198 1.1758 1.2141 1.8451 2.9519 1.8121 1.3826 1.3892 2.6075 1.3737 1.3601 3.5936 2.2983 7.0581 1.3571 1.3403 3.2606 1.3835 1.3668 4.0868 6.2191 5.4044 2.9298 2.7768 1.1318 1.1036 1.1225 1.1474 3.6665 2.9884 1.0923 1.1760 2.8301 1.1176 1.1048 3.0443 4.1365 6.2361 8.6029 8.3199 7.1998 7.0082 7.3036 6.9097 8.4817 7.4177 12.4542 1.0637 1.0644 1.0631 1.0648 1.0674 1.0666 1.0623 1.0623 1.0881 1.1021 1.1039 1.1034 1.1030 1.1026 1.1027 1.1058 1.1063 1.0882 1.0914 1.0909 1.0890 1.0877 1.0950 1.0908 1.0992 1.0939 1.0982 1.0954 1.0927 1.0923
irintensity: 1.1078 0.5946 0.3155 0.8641 1.9690 1.1943 1.2624 2.7763 2.2766 1.2406 0.3910 0.2690 1.7867 9.3970 2.1819 2.7234 0.4674 3.8708 0.4234 4.1893 2.0791 1.9222 5.9246 3.2034 2.6226 5.9541 9.1469 13.2108 4.2417 0.3900 1.7886 3.4453 1.2917 2.6361 59.4814 1.3788 20.0191 3.8718 55.7463 2.3785 3.3864 39.9749 73.5638 15.3367 8.5313 0.6964 6.5074 56.8835 1.9708 2.1745 3.2979 15.5362 3.2385 1.7718 22.1873 43.5791 11.3849 12.6297 18.6538 12.6891 0.7821 21.8769 5.2346 43.7997 22.6393 77.1126 52.0687 9.8117 4.5580 1.2200 5.5115 5.3184 1.2149 50.2573 9.7117 19.1011 43.3602 6.1310 10.5915 0.3182 1.9314 18.3884 69.4469 1.7384 10.8622 65.0306 13.1397 29.6489 0.4025 16.5089 3.1084 41.9984 1.1900 6.7549 22.9369 2.4211 2.7074 1.3328 0.4296 8.1823 0.2864 658.7996 15.0818 0.8766 9.1772 20.5692 1044.7184 141.4932 190.7858 13.4041 347.0591 1295.8030 0.6022 17.7795 0.7842 1.7474 1.0520 2.8970 84.2870 7.1638 27.7428 10.3979 14.2729 498.7614 22.0799 28.2740 23.4024 30.4456 2.2074 13.4649 104.3192 1638.8351 13.2003 0.1302 0.7917 474.5602 13.5072 1.0092 462.0431 70.0983 11.1877 1.8937 6.7055 527.2749 10.0634 2.7683 957.8591 676.7680 2.5290 290.3088 18.8203 0.8574 1.9545 9.0567 38.3582 333.8476 54.2347 2.7605 1.7789 25.7988 18.5925 5.1892 3.8511 60.7262 278.8925 14.4165 360.5888 620.5288 79.4556 25.4342 46.9292 270.8008 120.2610 443.9194 94.8736 67.6393 56.8736 9.2135 13.8153 21.5888 25.5466 16.9224 26.3726 36.2789 18.5721 50.5656 25.3256 16.1772 13.9919 40.3640 39.7911 6.9586 7.7305 22.5272 2.9585 2.3734 15.4344 3.6807 25.3152 1.5199 19.4045 2.3558 0.8829 1.5063
temp: 298.150 k
press: 1.00000 atm
elementType: 3 6 6 6 6 6 6 6 6 6 6 6 1 6 6 6 1 1 1 1 1 1 8 8 7 7 6 1 6 6 7 6 1 6 6 1 6 8 6 6 6 1 1 1 1 1 1 1 1 6 8 6 6 6 1 1 1 1 1 1 1 1 6 6 6 6 1 1 1 1
symmnumber: 1
zpe: 1489783.4 jmol-1
zpe.correction: 0.567429 hartree
zpe.thermalcorrener: 0.602386 hartree
zpe.thermalcorrenthalpy: 0.603330 hartree
zpe.thermalcorrgfe: 0.494694 hartree
zpe.sumelectzpe: -1709.040324 hartree
zpe.sumelectthermal: -1709.005367 hartree
zpe.sumelectthermalent: -1709.004423 hartree
zpe.sumelectthermalfe: -1709.113059 hartree
dipole: 3.9054 -6.8836 0.3650
dipole: 7.9227
quadrupole: -205.9618 -201.6271 -221.2100
quadrupole: 34.4374 9.2708 0.7347
quadrupole: 3.6378 7.9725 -11.6103 34.4374 9.2708 0.7347
hfenergy: -1709.6077527 hartree
pointgroup: C01 [X(C32H30Li1N3O4)]
dipole: 1.5365076 -2.708213 0.1435942 debye
polarizability: 1010.0531581|-18.7153189|593.9224878|-34.9959246|-8.8049051|246.6993414 unknown
InChI: InChI=1S/C24H14N3O2.2C4H8O.Li/c28-23-17-7-2-3-8-18(17)24(29)22-19(23)9-5-11-21(22)27-25-14-16-13-12-15-6-1-4-10-20(15)26-16;2*1-2-4-5-3-1;/h1-14H;2*1-4H2;/q-2;;;+2
charge 0 multiplicity 1
70 atoms
Li -0.442889 -1.05939 0.332924
C  -0.935069 3.177951 -0.158898
C  -1.226834 1.776806 -0.032844
C  -2.617249 1.404928 0.075171
C  -3.613065 2.431277 0.013416
C  -3.278362 3.760333 -0.111352
C  -1.920251 4.125748 -0.188964
C  -3.040206 0.031247 0.266463
C  -5.074247 2.123436 0.075896
C  -5.479304 0.699155 0.15431
C  -4.500369 -0.295531 0.248137
C  -4.8921 -1.634944 0.325802
H  -4.127749 -2.400626 0.402995
C  -6.240621 -1.971588 0.303892
C  -7.21397 -0.974722 0.210717
C  -6.833048 0.359244 0.138752
H  0.103274 3.46957 -0.237367
H  -4.064076 4.505125 -0.150972
H  -1.651384 5.173792 -0.283764
H  -6.536765 -3.01419 0.360727
H  -8.265795 -1.240884 0.195288
H  -7.571676 1.150734 0.067912
O  -5.915131 3.011891 0.05315
O  -2.265333 -0.92673 0.446256
N  -0.251192 0.840725 -0.051517
N  1.005336 1.34896 -0.138116
C  1.933948 0.47944 -0.331449
H  1.719557 -0.586349 -0.45912
C  3.34675 0.861792 -0.377492
C  3.751376 2.22991 -0.322464
N  4.203592 -0.141799 -0.454622
C  5.082983 2.525033 -0.354118
H  2.992831 3.001095 -0.257199
C  5.535862 0.141244 -0.484612
C  6.034779 1.471776 -0.437313
H  5.431315 3.553833 -0.316731
C  -0.728862 -1.749191 -2.324584
O  -0.137888 -2.28706 -1.122865
C  -0.697149 -3.587664 -0.841421
C  -1.603552 -3.922134 -2.024492
C  -2.016779 -2.534187 -2.519781
H  -0.874551 -0.676083 -2.170906
H  -0.032821 -1.904552 -3.157544
H  0.123988 -4.297712 -0.71327
H  -1.264595 -3.5219 0.095572
H  -1.03716 -4.44647 -2.800406
H  -2.447582 -4.548242 -1.728851
H  -2.352804 -2.527731 -3.558403
H  -2.808754 -2.121783 -1.885877
C  1.714225 -2.687212 1.513221
O  0.690039 -1.694158 1.725358
C  1.10722 -0.755321 2.73844
C  2.602524 -0.984396 2.905169
C  2.717999 -2.48742 2.643072
H  1.241409 -3.672589 1.518276
H  2.174827 -2.51261 0.53321
H  0.846433 0.25019 2.396024
H  0.559909 -0.976339 3.662162
H  3.159966 -0.427185 2.145508
H  2.957931 -0.68629 3.893293
H  3.723556 -2.799014 2.354041
H  2.4152 -3.053977 3.529412
C  6.4565 -0.936371 -0.563815
C  7.433356 1.69342 -0.472156
C  8.302702 0.632658 -0.549861
C  7.807225 -0.693412 -0.595409
H  6.056539 -1.945075 -0.598292
H  7.802053 2.714937 -0.436053
H  9.373647 0.805967 -0.576318
H  8.505815 -1.522066 -0.656136
