program: Gaussian 16
title: Title Card Required
version: ES64L-G16RevA.03
frameworkgroup: C1[X(C6H6F20Sb3Te)]
method: RPBE1PBE
basis: def2TZVP
operation: Freq
keyword: #P
keyword: Geom=AllCheck
keyword: Guess=TCheck
keyword: SCRF=Check
keyword: GenChk
keyword: RPBE1PBE/def2TZVP
keyword: Freq
converged: YES YES NO NO
title: Mulliken charges:
elementType: Sb Sb F Sb F F F F F F F F F F F F F F F C C C C C C H H H H H Te F F F F H
charge: 1.896287 1.926854 -0.377940 1.928582 -0.447130 -0.373661 -0.379512 -0.364024 -0.446492 -0.382950 -0.369531 -0.368126 -0.445570 -0.386947 -0.363174 -0.378272 -0.379133 -0.370112 -0.349997 -0.086214 -0.220996 0.437632 -0.208807 -0.072798 0.017728 0.207514 0.223005 0.224273 0.210120 0.225148 1.498535 -0.311423 -0.331878 -0.324829 -0.282418 0.226255
chargesum: 1.00000
title: Mulliken charges with hydrogens summed into heavy atoms:
elementType: Sb Sb F Sb F F F F F F F F F F F F F F F C C C C C C Te F F F F
charge: 1.896287 1.926854 -0.377940 1.928582 -0.447130 -0.373661 -0.379512 -0.364024 -0.446492 -0.382950 -0.369531 -0.368126 -0.445570 -0.386947 -0.363174 -0.378272 -0.379133 -0.370112 -0.349997 0.121301 0.002008 0.437632 0.015466 0.137322 0.469131 1.498535 -0.311423 -0.331878 -0.324829 -0.282418
polarizability: 2.62523808e+02 1.35650951e+01 3.23961203e+02 -9.38389449e-01 -5.43875318e+01 2.98544241e+02
1716.lowfreq: -391.9468 -6.4652 -0.0005 0.0005 0.0007 6.9523 13.3185 20.0498 25.2322
frequency: -391.9432 18.4114 24.8120 28.6349 35.7735 45.9089 50.2030 55.2045 64.1627 71.7486 74.5649 80.0375 84.2314 99.7052 102.3877 111.3934 112.1162 116.4596 120.3542 133.9932 136.9294 137.8721 146.1299 162.3979 165.4134 169.0976 173.8811 177.2124 186.9187 194.4722 201.8604 205.8047 210.4219 214.4803 219.9928 230.5875 237.7632 240.9850 244.1463 245.4188 246.2947 253.1537 256.6653 259.2271 263.7765 268.5689 279.4252 284.3984 294.7313 304.7746 307.7690 318.7097 323.8671 378.3363 386.2722 416.8506 470.6637 503.5295 515.1786 561.0726 561.8098 617.7875 632.3711 652.4728 654.0926 660.3702 680.5830 692.5707 693.9854 696.2204 698.3437 701.5733 701.9788 704.2149 722.7960 723.7184 726.7340 751.6199 768.3567 874.5358 916.5310 928.3210 991.5560 1008.3964 1011.9890 1050.3476 1157.4568 1166.5412 1214.7542 1243.5562 1338.1637 1428.8955 1455.7374 1479.3661 1558.1502 1615.6015 2988.7038 2991.0789 3222.9447 3223.4242 3240.8180 3256.0671
redmass: 10.9846 21.6822 11.3842 15.1405 18.4830 15.6125 8.5707 19.2075 17.4076 8.6497 13.8801 17.0909 10.0829 14.0032 16.3957 18.4037 18.0556 18.9154 6.2021 8.9697 19.3456 19.3136 13.7920 13.5193 15.8080 15.1586 18.0731 10.7486 3.9737 21.4677 10.4882 16.2353 11.7191 14.0235 8.0566 16.0665 10.2516 20.6903 20.9851 20.3617 20.9369 10.7258 22.8804 22.7123 18.0850 19.7150 15.4610 12.8743 6.8568 6.7025 14.5930 19.3602 19.6022 11.5855 2.9729 13.5014 15.2531 9.0345 4.1243 6.1184 6.4523 8.7924 22.7922 19.3294 19.4100 19.5842 15.0938 19.9436 18.6730 21.2310 15.9790 21.5906 20.3858 18.0241 23.2184 22.8676 22.3462 2.8453 1.2077 1.5187 3.9820 6.5829 1.2747 2.1246 1.5391 1.4184 1.2226 1.1450 1.1220 1.0608 1.3453 2.3744 1.6227 6.7040 6.0634 5.2753 1.0676 1.0851 1.0891 1.0920 1.0977 1.0950
irintensity: 792.9503 0.7071 8.5213 4.1451 1.5808 6.2054 5.1835 4.2950 6.5487 9.4292 3.1871 2.3561 9.3190 141.3901 1.5878 1.7355 1.0609 2.2649 6.0002 20.0865 26.3196 23.2981 51.2754 10.7977 12.1283 24.1943 7.5843 14.8701 69.3369 228.5844 46.3538 32.1171 341.5901 53.6113 109.2434 14.7891 23.5519 49.2224 35.1075 11.1179 81.6051 95.8094 30.3322 15.3377 8.1721 6.4316 79.8401 93.4631 22.9024 49.1817 2.8076 58.5547 21.8566 41.2531 1.9600 554.9064 327.8861 264.4373 10.9253 194.7084 12.3195 3.7580 288.4529 25.4202 57.6432 57.1972 212.5819 87.7191 193.2894 130.1923 308.2197 66.4192 4.5289 147.3471 100.5920 48.4120 357.1316 79.0570 1.2883 111.4060 28.5074 324.8286 4.5047 24.1098 28.6082 7.2164 0.2897 1.3293 188.0919 263.3919 33.7266 19.8829 181.6747 384.9595 2.1218 756.4330 219.4152 45.3033 4.8655 23.0234 42.4105 53.8980
temp: 298.150 k
press: 1.00000 atm
elementType: 51 51 9 51 9 9 9 9 9 9 9 9 9 9 9 9 9 9 9 6 6 6 6 6 6 1 1 1 1 1 52 9 9 9 9 1
symmnumber: 1
zpe: 386571.4 jmol-1
zpe.correction: 0.147237 hartree
zpe.thermalcorrener: 0.186667 hartree
zpe.thermalcorrenthalpy: 0.187611 hartree
zpe.thermalcorrgfe: 0.072289 hartree
zpe.sumelectzpe: -3216.688817 hartree
zpe.sumelectthermal: -3216.649387 hartree
zpe.sumelectthermalent: -3216.648443 hartree
zpe.sumelectthermalfe: -3216.763766 hartree
dipole: -14.1182 -14.8330 13.1820
dipole: 24.3538
quadrupole: -209.4001 -211.7662 -209.4616
quadrupole: 41.8339 -27.6741 -33.5961
quadrupole: 0.8092 -1.5569 0.7477 41.8339 -27.6741 -33.5961
hfenergy: -3216.8360547 hartree
pointgroup: C01 [X(C6H6F20Sb3Te1)]
dipole: 5.22674 5.6221246 5.7339667 debye
polarizability: 261.7295579|10.2395474|316.7782251|-1.0607763|55.9727753|306.5214693 unknown
InChI: InChI=1S/C6H6F5Te.13FH.2F.3Sb/c7-12(8,9,10,11)6-4-2-1-3-5-6;;;;;;;;;;;;;;;;;;/h2-5H,1H2;13*1H;;;;;/q;;;;;;;;;;;;;;;;2*+4;+5/p-13
charge 1 multiplicity 1
36 atoms
Sb -0.55810432 2.51076865 -1.07706697
Sb -2.97359598 -0.07510412 0.74760713
F  -3.95870129 1.21055043 1.63655141
Sb -0.41078251 -2.82668725 -0.60243543
F  -1.69687069 -1.24351063 -0.30656288
F  -1.80712518 -0.36757608 2.15615431
F  -4.02588573 -1.5533463 1.09186712
F  -3.69584913 0.28552278 -0.91405061
F  -1.62284031 1.37849112 0.25948366
F  -1.89320406 -3.90181063 -0.87267732
F  -0.46993471 -2.99753415 1.23979689
F  -0.38612822 -2.1925153 -2.33939736
F  0.95885704 -1.41544779 -0.2459622
F  0.91057645 -4.09562846 -0.85605271
F  -0.86035659 1.09932814 -2.23292341
F  -2.11364449 3.41124516 -1.50265717
F  0.61888217 3.40265281 -2.18886226
F  -0.18660729 3.53298165 0.42224465
F  0.96197033 1.34690327 -0.40388212
C  1.49184501 1.6827898 3.24665554
C  1.27198005 0.95337851 2.12096029
C  2.02292288 1.33687994 1.01065188
C  2.90527679 2.41012032 0.88844412
C  3.11061294 3.12017835 2.03059507
C  2.42691505 2.79776723 3.27429339
H  0.95616894 1.42915935 4.15433573
H  0.58717306 0.11730848 2.09972179
H  3.39989164 2.65399215 -0.04207212
H  3.79699407 3.95915982 2.01519258
H  1.91666642 3.69975614 3.65981977
Te 2.98087972 -0.61236916 -0.01518722
F  4.74641384 -0.11249534 0.13908287
F  3.01447878 -1.46137002 1.66161877
F  2.92603256 -0.07891025 -1.81393254
F  3.42163809 -2.25988353 -0.67796708
H  3.16881366 2.64202088 4.0799084
