program: Gaussian 16
title: Title Card Required
version: ES64L-G16RevA.03
frameworkgroup: D3H[O(Sb),C3(F.F),3C2(F)]
method: RPBE1PBE
basis: def2TZVP
operation: Freq
keyword: #P
keyword: Geom=AllCheck
keyword: Guess=TCheck
keyword: SCRF=Check
keyword: GenChk
keyword: RPBE1PBE/def2TZVP
keyword: Freq
converged: YES YES NO YES
polarizability: 3.76020138e+01 -4.95367702e-11 3.75968331e+01 7.55460673e-12 -2.98079671e-09 4.07864102e+01
1716.lowfreq: -33.6251 -21.1697 -0.4748 -0.1088 1.3144 8.0047 79.7940 80.1427 230.9472
frequency: 79.7930 80.1415 230.9472 231.6711 257.3461 267.8570 268.1489 616.5991 674.8561 702.8540 709.1489 709.1932
redmass: 19.2162 19.2106 23.9116 23.9229 23.3520 18.9984 19.0009 18.9984 18.9984 23.2905 22.4579 22.4556
irintensity: 2.6311 2.5534 75.6356 75.7128 81.2613 0.0000 0.0595 0.0000 0.0024 186.6366 146.4855 146.4764
temp: 298.150 k
press: 1.00000 atm
elementType: 51 9 9 9 9 9
symmnumber: 6
zpe: 28881.2 jmol-1
zpe.correction: 0.011000 hartree
zpe.thermalcorrener: 0.018410 hartree
zpe.thermalcorrenthalpy: 0.019354 hartree
zpe.thermalcorrgfe: -0.020632 hartree
zpe.sumelectzpe: -739.310599 hartree
zpe.sumelectthermal: -739.303189 hartree
zpe.sumelectthermalent: -739.302245 hartree
zpe.sumelectthermalfe: -739.342231 hartree
hfenergy: -739.321599 hartree
pointgroup: D03H [O(Sb1),C3(F1.F1),3C2(F1)]
dipole: 0. 0. 0. debye
dipolederiv: 3.4012091 0. 0. 0. 3.4010202 0. 0. 0. 3.7434195 -0.5070856 -0.000001 0. -0.000001 -1.0205233 0. 0. 0. -0.5790998 -0.8927225 0.2221102 0. 0.221104 -0.6360352 0. 0. 0. -0.5788079 -0.5537816 0. 0. 0. -0.5536311 -0.0006927 0. 0.0010163 -1.0036327 -0.8927242 -0.2221093 0. -0.221103 -0.6360335 0. 0. 0. -0.5788079 -0.5537816 0. 0. 0. -0.5536311 0.0006927 0. -0.0010163 -1.0036327 unknown
polarizability: 37.6020138|0.|37.5968331|0.|0.|40.7864102 unknown
InChI: InChI=1S/5FH.Sb/h5*1H;/q;;;;;+5/p-5
charge 0 multiplicity 1
6 atoms
Sb 0.0000 0.00000009 0.0000
F  0.0000035 1.84968137 0.0000
F  1.60186923 -0.92484358 0.0000
F  0.0000 0.00000009 1.86203117
F  -1.60187273 -0.92483751 0.0000
F  0.0000 0.00000009 -1.86203117
