program: Gaussian 16
title: Title Card Required
version: ES64L-G16RevA.03
frameworkgroup: C1[X(C7H5F17Sb2Te)]
method: RPBE1PBE
basis: def2TZVP
operation: Freq
keyword: #P
keyword: Geom=AllCheck
keyword: Guess=TCheck
keyword: SCRF=Check
keyword: GenChk
keyword: RPBE1PBE/def2TZVP
keyword: Freq
converged: YES YES NO NO
title: Mulliken charges:
elementType: C C C C C C H H H H H Te F F F Sb F F F F F F Sb F F F F F C F F F
charge: 0.047420 -0.209419 0.330070 -0.212621 0.048543 -0.221326 0.195981 0.226293 0.229361 0.196584 0.178341 1.222102 -0.331757 -0.418251 -0.434029 1.889490 -0.406875 -0.443630 -0.409749 -0.407940 -0.421415 -0.464073 1.890126 -0.457952 -0.403828 -0.416596 -0.406415 -0.427136 0.383847 -0.113047 -0.117033 -0.115064
chargesum: -0.00000
title: Mulliken charges with hydrogens summed into heavy atoms:
elementType: C C C C C C Te F F F Sb F F F F F F Sb F F F F F C F F F
charge: 0.243401 0.016874 0.330070 0.016741 0.245127 -0.042985 1.222102 -0.331757 -0.418251 -0.434029 1.889490 -0.406875 -0.443630 -0.409749 -0.407940 -0.421415 -0.464073 1.890126 -0.457952 -0.403828 -0.416596 -0.406415 -0.427136 0.383847 -0.113047 -0.117033 -0.115064
chargesum: 0.00000
polarizability: 2.23932548e+02 -2.68400778e+01 3.16704357e+02 -3.01349737e+01 3.39939317e+01 2.56562063e+02
1716.lowfreq: -133.2060 -10.0187 -4.5318 -0.0006 -0.0004 -0.0003 2.5806 8.3518 22.9105
frequency: -133.1931 7.7725 22.7194 26.3064 27.9138 36.6852 38.0042 43.0959 50.2868 51.6927 56.8880 59.9757 65.9438 68.8371 78.4304 110.2493 114.0342 119.0647 123.0495 129.0083 149.4330 156.2676 164.1451 178.0425 191.8058 197.8129 199.2734 208.1058 217.6673 217.8224 250.9710 252.6815 254.1955 254.9637 256.7835 271.4603 274.4651 279.3942 283.0285 285.5425 291.4047 298.8595 323.6645 407.4913 423.6383 453.5815 469.5873 530.4040 539.4354 543.2658 554.7467 562.3971 566.3223 575.5549 577.5411 606.8942 635.2432 640.8870 656.2906 672.3071 677.0651 678.7150 683.2285 692.4271 695.5719 713.4786 752.5881 869.1212 877.9893 957.2720 996.7818 1006.5793 1040.0110 1079.6789 1085.6231 1140.8629 1142.6838 1208.3632 1215.2465 1234.5743 1303.8205 1385.0561 1502.9944 1509.1893 1773.0276 3209.1652 3212.3516 3238.2106 3252.3639 3258.4655
redmass: 6.4804 15.6570 11.2057 15.5958 13.4408 13.3511 14.6307 10.7099 21.1059 9.8249 12.4145 6.7231 18.8987 12.7840 9.3533 18.3587 19.7242 5.3664 24.1492 16.1300 18.2460 18.9303 18.9533 18.8766 20.5547 19.6070 19.2914 22.7750 20.3905 19.9035 20.9634 21.5659 23.0651 22.3330 22.9619 18.6565 20.5357 23.5323 22.7817 20.3116 23.4280 20.3207 20.5358 3.9262 2.9282 4.8616 18.8591 18.6329 17.9565 17.6263 16.5525 9.1391 15.3511 1.4472 3.3627 7.1720 19.4962 19.3880 18.8541 20.9792 20.0055 20.9115 20.8106 22.3963 20.1347 1.2256 15.1652 5.5763 1.2821 1.3079 1.4033 1.9069 1.4366 5.4680 4.6851 1.2363 1.2107 13.3205 2.3100 13.2901 1.4296 3.3672 3.1598 3.3717 8.7610 1.0890 1.0889 1.0954 1.0969 1.0979
irintensity: 99.6345 2.4189 2.9153 0.7070 1.5084 1.9844 2.4700 1.6996 2.6259 2.4173 2.7239 0.3617 15.9218 1.1171 32.8131 0.4207 0.8847 3.3690 0.4429 1.0699 0.0878 1.2488 1.6808 1.0375 21.3964 32.9578 34.1600 184.7251 105.2104 55.2934 49.9804 55.7856 35.0527 80.8411 19.2769 4.3546 37.3542 5.9304 24.8340 29.5275 53.1276 17.5329 67.6168 15.2012 0.8912 17.6809 116.1182 144.9685 15.8171 31.3454 247.1217 78.1687 44.6074 6.0016 26.6951 184.7219 92.3094 149.9252 170.2679 153.0508 258.1445 56.7674 91.2453 119.3234 269.0994 225.3984 97.0749 303.2281 1.6581 0.9853 10.8986 87.7028 8.7255 849.5657 304.6117 29.7617 4.6413 388.8915 48.3057 368.2152 23.8797 235.3375 14.3667 46.8945 40.9064 28.7269 4.5178 17.8331 170.5328 112.2833
temp: 298.150 k
press: 1.00000 atm
elementType: 6 6 6 6 6 6 1 1 1 1 1 52 9 9 9 51 9 9 9 9 9 9 51 9 9 9 9 9 6 9 9 9
symmnumber: 1
zpe: 349882.8 jmol-1
zpe.correction: 0.133263 hartree
zpe.thermalcorrener: 0.167629 hartree
zpe.thermalcorrenthalpy: 0.168574 hartree
zpe.thermalcorrgfe: 0.060160 hartree
zpe.sumelectzpe: -2714.668860 hartree
zpe.sumelectthermal: -2714.634494 hartree
zpe.sumelectthermalent: -2714.633550 hartree
zpe.sumelectthermalfe: -2714.741964 hartree
dipole: 4.8859 14.9598 5.9891
dipole: 16.8385
quadrupole: -236.1263 -164.4335 -199.8845
quadrupole: 8.2524 -4.9835 29.2683
quadrupole: -35.9782 35.7146 0.2636 8.2524 -4.9835 29.2683
hfenergy: -2714.8021234 hartree
pointgroup: C01 [X(C7H5F17Sb2Te1)]
dipole: 1.7787735 5.9195773 2.383767 debye
polarizability: 225.299045|-28.9178988|315.046712|-31.0880966|33.5158465|256.8532115 unknown
InChI: InChI=1S/C6H5.CF6Te.10FH.F.2Sb/c1-2-4-6-5-3-1;2-1(3,4)8(5,6)7;;;;;;;;;;;;;/h1-5H;;10*1H;;;/q;;;;;;;;;;;;;2*+5/p-10
charge 0 multiplicity 1
32 atoms
C  0.13448337 3.49612409 2.83750949
C  0.17633146 2.25962704 2.1503593
C  0.61527311 2.53265411 0.92791995
C  0.94102801 3.53023058 0.11313749
C  0.86963134 4.71318738 0.88582258
C  0.46946071 4.68553877 2.21143562
H  -0.17843777 3.4562529 3.87483071
H  -0.09236108 1.30900156 2.58722387
H  1.22748654 3.49680783 -0.92827251
H  1.13201945 5.63458174 0.3781624
H  0.40817214 5.61229999 2.76656819
Te 2.32108903 0.35134064 -0.1095934
F  3.92754507 1.22190904 0.25611183
F  2.80206189 -0.76201958 1.39321485
F  2.37844317 1.37232174 -1.76789218
Sb -2.43703105 0.79880472 -0.93119886
F  -2.04110872 0.04402077 -2.58919371
F  -2.08772637 -1.0890606 -0.18829491
F  -4.21467722 0.25602076 -1.07224828
F  -2.69972033 1.28777841 0.85155716
F  -2.70047051 2.51690573 -1.59825295
F  -0.57502428 1.05954568 -0.66028124
Sb -0.78811768 -2.31057145 0.80713189
F  0.51585953 -1.63515202 -0.40267508
F  -1.26193547 -3.58341737 -0.46585441
F  0.43642037 -3.40185692 1.68430924
F  -2.23983996 -2.75873475 1.88379288
F  -0.42302197 -0.80861696 1.86966991
C  3.22169953 -1.2254046 -1.39203809
F  3.30048475 -2.37165739 -0.75319241
F  2.49663421 -1.37103524 -2.4840393
F  4.43585974 -0.81687761 -1.71998704
