program: Gaussian 16
title: Title Card Required
version: ES64L-G16RevA.03
frameworkgroup: C1[X(C7H5F17Sb2Te)]
method: RPBE1PBE
basis: def2TZVP
operation: Freq
keyword: #P
keyword: Geom=AllCheck
keyword: Guess=TCheck
keyword: SCRF=Check
keyword: GenChk
keyword: RPBE1PBE/def2TZVP
keyword: Freq
converged: YES YES NO NO
title: Mulliken charges:
elementType: C C C C C C H H H H H Te F F F C F F F Sb F F F F F F Sb F F F F F
charge: -0.113857 -0.111098 -0.243687 0.140409 -0.249350 -0.099391 0.155461 0.155856 0.171706 0.173760 0.156806 1.230243 -0.345540 -0.432371 -0.426708 0.609050 0.056425 0.054244 0.055157 1.893383 -0.470278 -0.455742 -0.411120 -0.414808 -0.425537 -0.416534 1.886964 -0.455387 -0.408589 -0.416296 -0.415985 -0.427185
chargesum: -0.00000
title: Mulliken charges with hydrogens summed into heavy atoms:
elementType: C C C C C C Te F F F C F F F Sb F F F F F F Sb F F F F F
charge: 0.041603 0.044758 -0.071981 0.140409 -0.075590 0.057415 1.230243 -0.345540 -0.432371 -0.426708 0.609050 0.056425 0.054244 0.055157 1.893383 -0.470278 -0.455742 -0.411120 -0.414808 -0.425537 -0.416534 1.886964 -0.455387 -0.408589 -0.416296 -0.415985 -0.427185
polarizability: 2.08242687e+02 6.81378251e+00 2.82089984e+02 1.23420304e+01 -4.57552502e+01 3.00953010e+02
1716.lowfreq: -98.6807 -0.9390 0.0011 0.0011 0.0012 6.1181 7.5261 13.2055 19.2860
frequency: -98.6609 10.6660 18.5001 26.3584 32.1172 35.4772 41.7416 43.4155 46.4790 53.6237 61.4885 69.9619 70.5932 75.1011 103.1292 110.0253 112.4146 123.1164 145.1390 153.4569 157.2537 162.7478 170.2048 179.1803 183.7675 194.3517 211.4305 216.5904 219.4018 220.9783 245.5375 254.3134 255.2132 257.2420 259.2663 270.5667 275.2986 278.4866 280.7107 283.8938 287.4649 306.9639 316.9788 403.6548 449.9165 475.2583 478.0919 544.5564 571.1751 576.3724 580.2397 583.2501 589.4319 618.2751 638.6906 645.5334 651.7062 668.2580 674.6042 676.0681 679.6521 684.2020 691.3829 693.5101 695.4752 757.7286 857.3046 961.2629 999.3396 1001.5972 1014.8711 1025.7959 1051.5291 1080.6894 1117.2525 1183.4265 1206.8856 1342.1031 1368.8220 1481.4291 1509.7112 1599.1684 1610.3852 1632.7191 1641.5794 3204.8663 3216.3590 3224.3794 3243.8527 3245.9952
redmass: 16.1824 11.3730 14.0196 14.3008 20.4156 7.9960 4.9878 10.1464 14.6705 22.9321 19.4521 18.8607 20.3335 19.6806 11.9737 21.2047 21.3181 27.4579 18.9450 13.9272 17.2875 12.6684 15.4121 15.6802 8.8844 19.0171 22.8845 20.7414 19.8358 18.7714 9.2683 21.2864 22.4212 22.9465 21.6223 6.3734 20.2887 24.9752 18.6028 19.3849 12.2555 21.1015 17.5322 2.8816 4.7026 8.3810 18.7599 22.7602 17.3170 18.0949 17.9564 19.1640 18.7443 6.4212 19.7889 20.0912 18.4773 20.7967 20.8742 21.9802 11.7276 9.6547 18.4952 11.3623 2.7244 1.4207 1.2484 1.3153 1.4054 11.2432 7.7226 1.3253 4.2738 2.0871 1.5344 1.0795 1.1296 1.4595 4.9467 2.2392 2.0250 13.2991 13.2969 5.7115 6.0124 1.0871 1.0906 1.0959 1.0940 1.0936
irintensity: 350.3591 0.2417 0.1940 1.8754 4.6096 1.7404 0.3724 0.1086 3.7036 14.5615 7.2614 16.1828 0.4565 0.9405 1.3042 0.6535 0.0497 0.0833 0.1423 1.1327 0.3112 0.2284 2.2936 0.4771 3.0342 0.8896 202.0582 108.9148 49.5707 69.2068 91.1828 98.6235 2.6305 10.1908 83.3114 0.3914 52.1469 7.2703 0.1780 10.2592 67.9395 65.9116 16.8740 0.2666 525.4936 670.3179 146.1588 399.8845 330.1053 15.8929 37.4049 10.8910 140.3189 0.5499 76.4109 174.0184 281.4533 136.1327 142.2817 22.5149 150.7168 104.5142 71.0789 332.9119 56.1268 81.4340 0.2047 2.5742 1.7060 143.0521 17.2818 0.1550 0.5829 43.4788 4.6459 0.6654 12.0980 0.6220 15.7472 32.0420 11.6351 519.4838 492.4580 1.0090 0.0291 1.5142 8.0081 3.9081 16.9041 10.0245
temp: 298.150 k
press: 1.00000 atm
elementType: 6 6 6 6 6 6 1 1 1 1 1 52 9 9 9 6 9 9 9 51 9 9 9 9 9 9 51 9 9 9 9 9
symmnumber: 1
zpe: 362881.2 jmol-1
zpe.correction: 0.138214 hartree
zpe.thermalcorrener: 0.171938 hartree
zpe.thermalcorrenthalpy: 0.172882 hartree
zpe.thermalcorrgfe: 0.066431 hartree
zpe.sumelectzpe: -2714.693705 hartree
zpe.sumelectthermal: -2714.659981 hartree
zpe.sumelectthermalent: -2714.659037 hartree
zpe.sumelectthermalfe: -2714.765488 hartree
dipole: -9.4129 4.5160 -4.7405
dipole: 11.4660
quadrupole: -233.9820 -203.0987 -176.9477
quadrupole: -4.3609 8.9560 -36.7116
quadrupole: -29.3059 1.5775 27.7284 -4.3609 8.9560 -36.7116
hfenergy: -2714.8319189 hartree
pointgroup: C01 [X(C7H5F17Sb2Te1)]
dipole: -3.4954165 -1.0714815 -2.6426949 debye
polarizability: 206.7417159|-10.7163933|250.132291|10.7365141|-15.7700204|334.4116739 unknown
InChI: InChI=1S/C6H5F3Te.CF3.10FH.F.2Sb/c7-10(8,9)6-4-2-1-3-5-6;2-1(3)4;;;;;;;;;;;;;/h1-5H;;10*1H;;;/q;;;;;;;;;;;;;2*+5/p-10
charge 0 multiplicity 1
32 atoms
C  -1.21530759 -1.25503876 4.22438332
C  -1.68235329 -0.0737476 3.66503546
C  -1.98629235 -0.01425431 2.31458156
C  -1.81106371 -1.16185773 1.5521873
C  -1.32695708 -2.3491438 2.0858848
C  -1.04080408 -2.38740352 3.44063764
H  -0.97898085 -1.29187068 5.28113111
H  -1.80998005 0.80966393 4.27825257
H  -2.35171189 0.90145102 1.87174348
H  -1.17866345 -3.22130628 1.46472262
H  -0.67169846 -3.30562151 3.88044513
Te -2.25635311 -1.07921049 -0.47110063
F  -3.9398538 -1.89052062 -0.53265517
F  -3.31468853 0.52347798 -0.19179222
F  -1.64976795 -2.8991444 -0.72085265
C  -1.41386213 0.03689022 -3.08382929
F  -1.99999071 1.11283479 -2.87587338
F  -1.96643339 -0.82513406 -3.78962886
F  -0.1878374 -0.0316538 -2.9034503
Sb 0.73156031 2.61686671 0.01168051
F  -0.61063176 1.34557707 -0.38557048
F  1.9560505 1.00892578 0.32371074
F  0.31025723 2.45312692 1.8223457
F  2.22940413 3.64944154 0.42951271
F  -0.40341257 4.06800125 -0.27335463
F  1.2787907 2.50882567 -1.77251049
Sb 2.42741453 -0.97712746 0.10516069
F  0.6554462 -1.19942758 -0.50581049
F  1.82273582 -1.14632141 1.86210329
F  4.11964574 -0.47965134 0.71904425
F  2.91384784 -0.52067416 -1.64021144
F  2.84365814 -2.78414934 -0.08791287
