program: Gaussian 09
title: 000003094
version: EM64L-G09RevD.01
frameworkgroup: C1[X(C16H35N)]
method: RPBEPBE
basis: SDD
operation: Freq
keyword: #pfreq=noraman
keyword: PBEPBE/SDD
title: #p freq=noraman PBEPBE/SDD
converged: YES YES NO NO
title: Mulliken charges:
elementType: N C C C C C C C C C C C C C C C C H H H H H H H H H H H H H H H H H H H H H H H H H H H H H H H H H H H
charge: -0.272920 -0.369490 -0.369481 -0.377030 -0.377036 -0.395331 -0.395314 -0.373309 -0.373322 -0.371968 -0.371962 -0.352892 -0.352894 -0.356714 -0.356713 -0.696462 -0.696463 0.189364 0.188068 0.188062 0.189366 0.193196 0.189523 0.189538 0.193183 0.217009 0.178461 0.178474 0.216995 0.206011 0.174048 0.174051 0.206004 0.189407 0.188393 0.188379 0.189418 0.233881 0.187291 0.188238 0.188240 0.187290 0.194970 0.194539 0.194548 0.194961 0.209501 0.209849 0.214847 0.209848 0.209503 0.214847
chargesum: 0.00000
title: Mulliken charges with hydrogens summed into heavy atoms:
elementType: N C C C C C C C C C C C C C C C C
charge: -0.039038 0.007942 0.007947 0.005689 0.005684 0.000139 0.000155 0.006749 0.006733 0.005832 0.005835 0.022636 0.022635 0.032794 0.032795 -0.062264 -0.062265
polarizability: 2.52317023e+02 -2.24517276e-04 1.57886535e+02 -8.80309861e-04 7.20638194e-01 1.47962297e+02
1716.lowfreq: -0.0020 -0.0014 0.0015 3.3977 6.3318 16.6870 19.1775 34.1659 46.6494
frequency: 19.1060 19.2275 34.1273 49.4226 52.0319 57.2554 68.8907 87.2496 91.6538 93.9820 108.8096 119.9626 133.6493 135.8089 143.4895 147.2829 150.4627 160.2010 164.8606 209.1583 229.0141 229.0263 251.6298 280.1197 336.2207 373.8031 412.4847 449.8053 458.5971 505.4396 521.1993 683.5468 722.6048 722.6410 729.5309 729.6987 751.6052 753.0308 793.4294 798.2555 860.1462 866.9245 887.5389 888.0012 936.1080 941.4542 982.6882 984.6572 998.2983 1007.6465 1012.8859 1014.5505 1035.0449 1039.8132 1061.1079 1064.1374 1077.8351 1078.8059 1080.0348 1081.2686 1087.1437 1107.6753 1121.9434 1129.5069 1146.1724 1179.0184 1186.3090 1198.5288 1212.7810 1221.7406 1222.0625 1235.4342 1253.5447 1260.2772 1262.3460 1270.0956 1276.9723 1278.2051 1282.4933 1284.5395 1292.9335 1293.6294 1295.7583 1297.1930 1297.5579 1305.7260 1328.4747 1338.0201 1350.2425 1354.6777 1355.7945 1356.7851 1360.5402 1390.2413 1390.2626 1392.6010 1452.1635 1462.2997 1462.4968 1463.1179 1463.2400 1466.1745 1466.9377 1469.8858 1470.8728 1476.4474 1477.1945 1477.1966 1477.6249 1483.0073 1484.3922 1488.5208 1489.3249 1491.5444 1499.2388 2831.5086 2840.4962 2950.3785 2950.4143 2951.3771 2951.4391 2953.0281 2953.3383 2956.3974 2956.5626 2962.9030 2963.1204 2968.7199 2968.8068 2972.0178 2972.0387 2984.4255 2984.4474 2989.5885 2991.6342 2991.8670 2991.9573 3003.6999 3003.7339 3019.6461 3019.6855 3034.2470 3034.3396 3044.6977 3045.2606 3068.6439 3068.6641 3070.3238 3070.3379 3414.4891
redmass: 3.7303 3.9143 3.6775 3.5677 1.5164 3.5555 1.5316 2.8901 3.7170 1.5915 2.0594 2.1130 4.2952 1.8229 2.2263 3.3902 1.9508 1.9837 2.3055 3.3604 1.1298 1.1306 4.2260 3.1567 3.0982 3.7203 2.9381 3.4152 2.8647 3.0131 3.1646 1.3025 1.0613 1.0615 1.0798 1.0809 1.1101 1.1142 1.1583 1.1693 1.2013 1.2161 1.9005 1.8938 1.1973 1.2348 4.7249 3.7439 2.8722 1.1452 4.0649 1.2311 3.4071 2.9926 2.8530 2.5469 2.2521 2.2995 2.1299 2.2793 2.1659 1.3350 2.2967 3.0310 4.1839 1.9822 1.7572 1.5687 1.2831 1.3553 1.4108 1.3943 1.2860 1.2665 1.2804 1.2893 1.0771 1.0496 1.0920 1.0900 1.1010 1.1241 1.2301 1.1043 1.1492 1.3400 1.3558 1.4419 1.4969 1.6287 1.6841 1.6627 1.6318 1.2188 1.2184 1.5091 1.2060 1.0727 1.0723 1.0720 1.0726 1.0661 1.0675 1.0780 1.0779 1.0775 1.0423 1.0423 1.0767 1.0850 1.0855 1.0912 1.0933 1.0986 1.0860 1.0717 1.0713 1.0590 1.0590 1.0588 1.0588 1.0612 1.0611 1.0619 1.0622 1.0605 1.0607 1.0587 1.0588 1.0367 1.0367 1.0964 1.0964 1.0846 1.0870 1.0981 1.0939 1.1011 1.1011 1.1030 1.1030 1.1035 1.1034 1.1033 1.1031 1.1007 1.1007 1.0993 1.0993 1.0737
irintensity: 0.0368 0.0157 0.0475 0.0079 0.0154 0.0868 0.7555 0.3175 0.0547 0.0923 0.1657 0.7823 0.0257 1.1844 0.0280 0.0357 0.0673 1.4974 1.5443 0.8712 0.0011 0.0004 0.0160 0.0675 0.7259 0.2378 0.4720 0.4974 3.2191 2.5358 1.6443 88.1401 0.0066 29.9675 0.0042 0.8565 0.0120 9.1642 0.1908 0.2903 0.6544 1.3537 3.1314 6.1890 1.2351 1.4579 0.6580 0.5047 0.5917 1.6664 3.0091 0.1400 0.0380 3.3654 0.0008 0.7847 0.0275 0.0294 0.0005 0.0155 0.8527 41.3911 2.4730 2.6576 59.8347 1.1126 1.2292 0.4086 20.9644 0.2608 0.0633 0.9761 0.5041 1.1845 0.2794 0.2710 0.9401 0.0419 0.4553 0.4684 0.0028 0.1620 0.9185 0.2988 1.6118 0.0066 3.4391 0.0336 10.4678 0.6321 0.0061 0.0030 7.8650 11.2743 12.0929 0.4172 35.8811 0.7377 0.0501 0.0045 0.0327 0.8040 0.1117 0.0160 1.0265 5.3643 15.8428 8.6549 0.9134 0.1357 1.1536 6.0349 45.9682 1.2188 7.2456 43.6192 182.4130 0.0043 0.3014 0.1244 2.6822 0.0510 3.6464 0.0123 1.5338 1.8654 90.8417 0.1503 331.1551 57.8435 16.0313 0.0043 0.8706 0.8522 61.0682 0.0022 29.0536 0.0158 0.9023 0.0392 1.4845 0.1766 32.4240 0.2445 378.3430 6.4024 191.9227 50.7057 60.5656 2.7170
temp: 298.150 k
press: 1.00000 atm
elementType: 7 6 6 6 6 6 6 6 6 6 6 6 6 6 6 6 6 1 1 1 1 1 1 1 1 1 1 1 1 1 1 1 1 1 1 1 1 1 1 1 1 1 1 1 1 1 1 1 1 1 1 1
symmnumber: 1
zpe: 1263558.0 jmol-1
zpe.correction: 0.481264 hartree
zpe.thermalcorrener: 0.504967 hartree
zpe.thermalcorrenthalpy: 0.505911 hartree
zpe.thermalcorrgfe: 0.424510 hartree
zpe.sumelectzpe: -683.990848 hartree
zpe.sumelectthermal: -683.967146 hartree
zpe.sumelectthermalent: -683.966201 hartree
zpe.sumelectthermalfe: -684.047602 hartree
dipole: 0.0001 0.4555 -0.8817
dipole: 0.9924
quadrupole: -113.2194 -113.2992 -110.1247
quadrupole: -0.0002 0.0010 1.7057
quadrupole: -1.0050 -1.0848 2.0897 -0.0002 0.0010 1.7057
hfenergy: -684.4721122 hartree
pointgroup: C01 [X(C16H35N1)]
dipole: -0.0001312 -0.1820819 -0.3453802 debye
polarizability: 252.3170191|-0.0030112|157.8739344|-0.0202271|-0.8026281|147.9749013 unknown
InChI: InChI=1S/C16H35N/c1-3-5-7-9-11-13-15-17-16-14-12-10-8-6-4-2/h17H,3-16H2,1-2H3
charge 0 multiplicity 1
52 atoms
N  0.000126 0.129762 -0.01167
C  -3.818647 -0.54256 -0.006937
C  3.81888 -0.542739 -0.00857
C  -5.065325 0.370513 0.00062
C  5.065615 0.370267 -0.002057
C  -2.489671 0.245223 -0.002564
C  2.489948 0.245111 -0.004218
C  -1.246973 -0.665975 -0.010865
C  1.247199 -0.666007 -0.011755
C  -6.397797 -0.412463 0.000535
C  6.398037 -0.412791 -0.00218
C  -7.64461 0.500525 0.005159
C  7.644917 0.500107 0.002605
C  -8.977731 -0.282337 0.005564
C  8.977984 -0.282851 0.00104
C  -10.217374 0.638249 0.009611
C  10.217699 0.637634 0.00637
H  -3.851027 -1.212264 0.87798
H  -3.855001 -1.203645 -0.898277
H  3.854894 -1.204424 -0.899483
H  3.851536 -1.211844 0.876786
H  -5.028974 1.03228 0.891095
H  -5.034446 1.040158 -0.884524
H  5.034403 1.039373 -0.887594
H  5.029675 1.032577 0.888033
H  -2.438571 0.902274 0.887387
H  -2.460119 0.913712 -0.890114
H  2.460189 0.913211 -0.892057
H  2.439125 0.902524 0.885488
H  -1.247891 -1.296449 0.901434
H  -1.312348 -1.369885 -0.88188
H  1.311947 -1.369838 -0.882887
H  1.248735 -1.29657 0.900478
H  -6.42984 -1.08069 0.886696
H  -6.432811 -1.075894 -0.889205
H  6.433084 -1.076144 -0.891977
H  6.429951 -1.081101 0.883923
H  -0.000141 0.815041 -0.7821
H  -7.61432 1.168782 -0.881084
H  -7.610966 1.164231 0.894636
H  7.612008 1.162711 0.892922
H  7.613994 1.169465 -0.882792
H  -9.00729 -0.949427 0.891396
H  -9.010136 -0.945524 -0.883134
H  9.010016 -0.944339 -0.888936
H  9.007814 -0.951633 0.885584
H  -10.225918 1.294236 -0.881477
H  -10.22344 1.289736 0.904003
H  -11.157034 0.055521 0.009471
H  10.224037 1.287535 0.901911
H  10.226075 1.295198 -0.883559
H  11.157315 0.054837 0.004968
