program: Gaussian 09
title: 000033758
version: EM64L-G09RevD.01
frameworkgroup: C1[X(C6H7BrN2)]
method: RPBEPBE
basis: SDD
operation: Freq
keyword: #p
keyword: freq=noraman
keyword: PBEPBE/SDD
title: #p freq=noraman PBEPBE/SDD
converged: YES YES NO NO
title: Mulliken charges:
elementType: Br N N C C C C C C H H H H H H H
charge: -0.022570 -0.411769 -0.581285 0.477576 -0.388255 -0.382240 -0.138924 -0.176726 -0.251981 0.238790 0.266053 0.224988 0.248018 0.289770 0.304621 0.303933
chargesum: 0.00000
title: Mulliken charges with hydrogens summed into heavy atoms:
elementType: Br N N C C C C C C
charge: -0.022570 -0.121999 0.027268 0.477576 -0.149465 -0.116187 -0.138924 0.048262 -0.003963
polarizability: 1.48097957e+02 4.54943617e-01 9.54322908e+01 -1.74472600e-02 7.11970730e-02 3.95527692e+01
1716.lowfreq: -10.9339 -8.3498 -0.0004 -0.0003 0.0004 5.0313 71.9193 155.3618 164.2765
frequency: 71.8667 155.3612 164.2731 211.6312 259.3668 270.8537 280.5858 291.2365 432.1333 452.6089 544.0647 582.6495 619.4661 664.9855 688.3870 775.4015 832.6618 849.8048 888.3447 969.3234 976.1333 1055.7490 1086.3376 1162.4785 1174.8110 1214.9392 1272.5866 1325.2030 1361.0519 1417.1018 1471.6990 1489.6766 1576.6762 1611.1859 1658.3251 3136.3573 3140.8668 3174.8364 3183.3649 3470.8745 3485.0129 3616.4002
redmass: 3.6388 6.1145 4.4039 3.1218 2.8778 1.2436 1.5947 6.2781 2.9790 5.6855 2.1518 1.5235 6.4440 7.6360 2.0851 1.3288 5.8719 1.6113 1.3876 5.5916 1.3100 2.0835 1.5713 1.3219 2.2964 1.1864 1.3701 2.3888 3.3379 3.6008 2.7341 1.7636 4.2158 4.5287 1.2110 1.0881 1.0917 1.0920 1.0973 1.0652 1.0503 1.1081
irintensity: 11.6932 2.2397 6.7460 3.2751 31.1226 94.4782 280.4177 6.2551 3.5929 0.8779 23.3986 16.9549 1.7303 27.8001 34.9367 49.2000 48.7286 40.5841 3.9852 23.9262 2.8666 13.7819 4.0219 10.8860 7.6089 2.3400 1.6662 6.7926 10.9929 4.8812 107.4290 60.3307 58.3623 159.2036 55.2213 14.8786 4.8858 2.3807 6.6865 13.5148 17.8721 4.7185
temp: 298.150 k
press: 1.00000 atm
elementType: 35 7 7 6 6 6 6 6 6 1 1 1 1 1 1 1
symmnumber: 1
zpe: 317409.2 jmol-1
zpe.correction: 0.120895 hartree
zpe.thermalcorrener: 0.129946 hartree
zpe.thermalcorrenthalpy: 0.130890 hartree
zpe.thermalcorrgfe: 0.085843 hartree
zpe.sumelectzpe: -355.104840 hartree
zpe.sumelectthermal: -355.095789 hartree
zpe.sumelectthermalent: -355.094844 hartree
zpe.sumelectthermalfe: -355.139891 hartree
dipole: 4.4583 -1.4701 0.0425
dipole: 4.6946
quadrupole: -47.9716 -53.7205 -65.2908
quadrupole: -7.2311 0.1294 -0.0392
quadrupole: 7.6893 1.9405 -9.6298 -7.2311 0.1294 -0.0392
hfenergy: -355.2257346 hartree
pointgroup: C01 [X(C6H7Br1N2)]
dipole: -1.8266537 -0.2577713 -0.0910738 debye
dipolederiv: -0.612908 0.2592954 -0.0196181 0.3102197 -0.2548664 0.0109212 -0.0188616 0.008812 -0.0685856 -0.6827567 -0.4821126 -0.0040761 -0.488547 -0.1203104 -0.0098362 0.0174964 -0.0037206 -0.5241703 -0.1222624 -0.1159376 -0.0049342 -0.4333271 -0.7262462 -0.0285782 -0.0164723 -0.0149038 0.0371999 1.1843232 0.5830619 0.0406066 0.7181163 0.3608674 0.0286791 0.040755 0.0218698 0.151209 -0.756516 -0.2158278 -0.0229125 0.2619761 -0.0788651 0.010281 -0.0211016 -0.0088697 -0.2029724 -0.2429223 -0.0225018 -0.0008665 -0.4854256 -0.2202338 -0.0190292 -0.0033612 -0.0001255 -0.2368669 1.1439174 -0.3126243 0.0451545 -0.5075163 0.6196605 -0.0155764 0.0438981 -0.007929 -0.0811724 0.4079218 -0.1288221 0.0196507 0.1185613 0.1387362 0.0059882 0.0209829 -0.0035422 -0.1216362 -0.4970591 0.2542094 -0.0108302 0.1768527 -0.3744427 0.0054784 -0.0109301 0.0087111 -0.1830666 0.0941474 -0.0305318 -0.0032781 -0.0189172 -0.0777793 -0.0021547 -0.0033041 -0.002607 0.1773547 0.0027057 0.0823822 -0.006122 0.0746686 0.0664676 0.0024726 -0.0059312 0.0026681 0.178347 0.0620561 0.016985 -0.0034183 0.0082897 -0.1309937 -0.0013291 -0.0036075 -0.000939 0.1527606 -0.0253849 -0.0742272 -0.0084113 -0.0633386 0.0622024 -0.0030359 -0.0081949 -0.0034407 0.1827582 0.0098997 0.0970247 -0.0146706 0.1411897 0.0387285 0.0019614 -0.0203378 -0.0048514 0.3531512 0.0151713 0.0434959 0.0424442 0.0889941 0.3481037 0.0639785 0.0438987 0.0333179 0.1001696 0.0196668 0.0461307 -0.0487181 0.0982035 0.3489713 -0.0502207 -0.0549286 -0.0244499 0.0855201 unknown
polarizability: 146.1187254|-9.6297533|97.2487279|4.1458064|-0.0729329|39.7155642 unknown
InChI: InChI=1S/C6H7BrN2/c7-5-2-1-3-6(4-5)9-8/h1-4,9H,8H2
charge 0 multiplicity 1
16 atoms
Br 3.27848 -1.257958 0.094989
N  -2.057202 -1.039685 -0.106764
N  -3.3032 -0.426303 -0.168161
C  -0.863356 -0.299075 -0.058021
C  0.37724 -1.002012 -0.013965
C  -0.862567 1.122823 -0.050374
C  1.572472 -0.266486 0.035724
C  0.360492 1.820432 0.000472
C  1.603577 1.142872 0.044417
H  0.396337 -2.097345 -0.018492
H  -1.821446 1.646283 -0.084454
H  0.354364 2.916375 0.006209
H  2.549041 1.688769 0.083323
H  -1.992767 -2.061551 -0.120685
H  -3.874292 -0.442591 0.677056
H  -3.782773 -0.427248 -1.068974
