program: Gaussian 09
title: Molecule Name
version: EM64L-G09RevB.01
method: RmPW1PW91
basis: 6-31+G(d,p)
operation: Freq
keyword: #N
keyword: Geom=AllCheck
keyword: Guess=TCheck
keyword: SCRF=Check
keyword: GenChk
keyword: RmPW1PW91/6-31+G(d,p)
keyword: Freq
keywords: Freq
multiplicity: 1
elementType: C C C C C C C C H H H O C H H H N H C H H C H H N C C C H H C C H H C H H C O O C H H H C H H H C C H H O H H
converged: YES YES NO YES
title: Mulliken atomic charges:
charge: 1.519756 -0.804833 -0.756766 0.459685 -0.508538 -1.200293 0.407621 0.321404 0.184792 0.179406 0.172037 -0.336451 -0.200315 0.171648 0.177118 0.171674 0.001393 0.365557 -0.322674 0.192650 0.190275 -0.307144 0.215289 0.217927 0.238521 -1.584265 0.791515 -0.125404 0.204295 0.217631 -0.034492 -0.013203 0.223834 0.212600 -0.057715 0.196957 0.191502 0.636516 -0.350461 -0.187067 -0.173119 0.196518 0.197180 0.195049 -0.308021 0.215774 0.179473 0.198485 -1.079299 -0.105531 0.169798 0.160812 -0.576886 0.398364 0.259421
chargesum: 1.00000
title: Mulliken charges with hydrogens summed into heavy atoms:
elementType: C C C C C C C C O C N C C N C C C C C C C O O C C C C O
charge: 1.519756 -0.804833 -0.571974 0.639092 -0.508538 -1.028256 0.407621 0.321404 -0.336451 0.320124 0.366950 0.060252 0.126072 0.238521 -1.324844 0.791515 0.296522 0.163993 0.423230 0.330743 0.636516 -0.350461 -0.187067 0.415628 0.087227 -1.079299 0.225079 -0.178523
1716.lowfreq: -13.8043 -6.3933 -4.7236 -0.0030 -0.0023 -0.0008 30.1061 43.4931 56.0279
frequency: 30.0093 43.4429 55.9540 63.5624 73.9728 80.5253 102.2613 109.8801 141.2016 146.6208 150.7804 181.1816 193.7351 196.1171 224.8793 234.9389 249.5844 253.6693 266.7913 275.7068 288.3024 293.3115 308.6012 328.0847 355.4752 374.8830 390.4642 407.5645 413.2867 426.6304 441.6563 447.1674 458.7703 471.5364 497.5054 520.6975 548.2940 566.7529 570.2582 585.5657 596.2407 607.0691 612.7357 642.8895 698.9211 702.0668 716.8026 748.5297 761.4825 764.5793 793.5423 811.7194 826.0942 849.1958 862.6716 867.1999 871.1946 876.9359 913.5153 925.4936 927.7693 945.3108 946.2104 946.8491 964.2211 979.9496 991.3296 994.3381 1001.2376 1024.5124 1056.5636 1066.9171 1070.7009 1080.2781 1093.2595 1105.8277 1112.9990 1130.5119 1144.7727 1168.4595 1176.9600 1177.2795 1180.3081 1194.5440 1203.8828 1206.8467 1209.4284 1225.8193 1238.8514 1242.4169 1246.8566 1255.1015 1261.5842 1272.5088 1281.8393 1285.6390 1302.4502 1328.5525 1335.0251 1335.9682 1343.5067 1349.9228 1353.7054 1363.8190 1370.6852 1383.5499 1399.4870 1403.1344 1426.9062 1448.0595 1458.2126 1470.9197 1472.8894 1477.5903 1478.3353 1482.6444 1489.0025 1490.7118 1492.0191 1494.1929 1496.0464 1500.0584 1506.5729 1509.6615 1513.6756 1523.4207 1538.6301 1550.0015 1649.1197 1700.3736 1729.6547 1804.0115 3051.2726 3067.6150 3081.5193 3099.1818 3100.6582 3106.2615 3107.0787 3126.7362 3128.3639 3132.7920 3140.7290 3145.0419 3148.6204 3153.7901 3155.4005 3167.4541 3190.1331 3195.1407 3203.0596 3204.2419 3231.1159 3232.9479 3232.9506 3240.6865 3261.0391 3672.1302 3887.5810
redmass: 4.8370 6.6074 4.2861 4.2713 3.8068 3.9054 3.6386 3.8809 1.9680 1.5734 3.6068 3.8477 3.4973 3.6034 3.8554 3.1594 3.0632 3.8067 1.6412 3.2360 3.5489 1.4528 1.8094 3.5449 2.9492 2.4342 3.3704 6.2617 3.9063 3.0892 3.5341 2.7849 3.4055 2.4934 2.9617 3.6789 3.5253 3.9772 2.8498 2.2812 3.7219 1.9519 3.1897 2.1354 4.1096 4.8113 4.4801 4.8188 4.0886 4.3155 4.6508 1.6635 3.2255 3.4105 2.4043 1.8125 2.8447 2.1997 2.4426 2.7580 2.8567 2.6640 2.1957 1.3152 2.5228 1.9104 3.8066 2.2875 2.6231 2.3331 2.1532 2.2523 2.2457 2.9547 2.4207 4.0441 2.0120 2.3294 2.4256 1.3240 1.2861 1.2758 1.4562 1.5839 1.8790 1.3521 1.4479 1.7169 1.5849 1.6935 1.4565 1.7844 1.5940 1.2613 1.7652 1.8291 2.3508 1.3864 1.5092 2.2102 1.4160 1.3398 1.5360 4.6797 1.6429 1.7309 1.5625 1.4871 5.6502 1.5345 1.4836 1.1970 1.1098 1.4270 1.2229 1.0439 1.1862 1.5278 1.2898 1.0438 1.2223 2.1005 1.1150 1.1264 1.1279 1.0943 3.9244 4.1160 6.2265 7.3339 6.4397 11.2068 1.0335 1.0627 1.0681 1.0609 1.0653 1.0295 1.0624 1.1068 1.1009 1.0611 1.0670 1.0974 1.0831 1.0969 1.1068 1.1058 1.1015 1.1044 1.1108 1.1088 1.0911 1.0919 1.1074 1.0947 1.0927 1.0809 1.0668
irintensity: 0.4269 5.9027 1.7208 4.0633 5.7930 3.9312 1.8478 0.4372 23.4027 10.7970 5.2650 2.3357 1.5326 1.4423 2.1328 7.8196 4.0183 3.6735 1.4284 7.1263 8.6706 99.4869 82.4558 24.8534 6.8286 0.6586 4.1452 0.3431 19.4574 9.9320 3.5648 2.1742 5.6249 9.7050 18.7455 6.9959 11.2388 19.6674 26.5537 45.6430 1.8110 32.8097 8.1272 96.1074 3.1682 1.9433 8.6148 3.3219 14.7560 2.5252 1.9215 58.4580 48.6289 14.0100 25.1737 63.1348 5.3329 1.1453 11.9724 4.5878 5.4543 10.9058 36.0458 1.2541 4.1263 18.2148 12.9285 0.9742 27.4674 3.9277 16.3841 10.7931 7.0012 49.8279 104.2423 39.2749 26.6504 105.2996 96.1555 2.0843 2.4796 1.3560 1.3637 30.6446 41.1051 16.0116 22.0336 15.3143 37.1827 88.3456 31.8910 122.0390 98.2953 37.0566 113.3360 191.1269 281.4110 45.0519 16.6790 177.8858 19.7037 20.4970 5.8408 2.5591 33.0165 0.9761 3.5018 14.4312 65.8481 40.3843 32.9494 1.9148 14.5132 66.5617 24.5148 19.5300 21.9664 14.2665 15.5783 12.4753 55.5420 59.5332 129.6593 9.6291 44.3810 6.7203 138.6405 166.2751 122.7171 56.1407 140.9595 497.8144 98.1569 68.4937 23.4802 36.9261 33.6395 41.1336 18.1594 50.8499 41.6057 15.1834 17.7884 14.8789 38.4748 14.6147 14.4579 5.9505 26.3797 3.4081 8.9288 13.2268 16.3448 0.9024 8.0035 40.6621 6.2163 441.7743 88.0346
temp: 298.150 k
press: 1.00000 atm
elementType: 6 6 6 6 6 6 6 6 1 1 1 8 6 1 1 1 7 1 6 1 1 6 1 1 7 6 6 6 1 1 6 6 1 1 6 1 1 6 8 8 6 1 1 1 6 1 1 1 6 6 1 1 8 1 1
symmnumber: 1
zpe: 1238532.4 jmol-1
zpe.correction: 0.471732 hartree
zpe.thermalcorrener: 0.496227 hartree
zpe.thermalcorrenthalpy: 0.497171 hartree
zpe.thermalcorrgfe: 0.418944 hartree
zpe.sumelectzpe: -1264.146005 hartree
zpe.sumelectthermal: -1264.121510 hartree
zpe.sumelectthermalent: -1264.120565 hartree
zpe.sumelectthermalfe: -1264.198793 hartree
dipole: 5.1671 -1.6981 3.0067
dipole: 6.2147
quadrupole: -126.7784 -107.0684 -160.9340
quadrupole: -15.5688 -0.0135 7.9402
quadrupole: 4.8152 24.5252 -29.3404 -15.5688 -0.0135 7.9402
hfenergy: -1264.6177368 hartree
pointgroup: C01 [X(C22H27N2O4)]
dipole: 2.0597776 -0.7597183 1.0763087 debye
polarizability: 468.9713879|-9.0826723|376.9144302|-16.5680467|24.0131951|278.1494449 unknown
InChI: InChI=1S/C22H27N2O4/c1-27-15-3-4-18-17(9-15)16-5-7-24-12-14-10-21(13-24,6-8-25)22(11-14,19(16)23-18)20(26)28-2/h3-4,9,13-14,23,25H,5-8,10-12H2,1-2H3
charge 1 multiplicity 1
55 atoms
C  -2.06890565 -0.38063815 -0.46240806
C  -1.9520167 0.9919454 -0.16216674
C  -3.05807564 1.7831215 0.14052079
C  -4.30823939 1.1782363 0.14909695
C  -4.44522084 -0.19585336 -0.14513513
C  -3.33759185 -0.97786685 -0.45290161
C  -0.7468223 -0.88020125 -0.74173319
C  0.12532554 0.21312255 -0.58581342
H  -2.95579198 2.83910662 0.36475329
H  -5.17711345 1.77853931 0.38539689
H  -3.48612804 -2.02859534 -0.67634004
O  -5.64747408 -0.84313856 -0.15036747
C  -6.81646991 -0.10167841 0.15223826
H  -6.97664796 0.70575363 -0.56961072
H  -7.64255546 -0.80825166 0.08857114
H  -6.77574328 0.31465494 1.1640304
N  -0.62270691 1.31109773 -0.24374283
H  -0.22349215 2.21797088 -0.05898717
C  -0.53896629 -2.32761182 -1.0925614
H  -1.51231615 -2.78987412 -1.26907239
H  0.01492218 -2.45822237 -2.0262723
C  0.15985335 -3.14930862 0.0147589
H  -0.39987594 -3.11453119 0.9495971
H  0.31169875 -4.1870526 -0.28050447
N  1.45214701 -2.49360572 0.1998942
C  1.46813682 -1.41308085 0.90575869
C  2.41627692 -0.28739784 0.62666456
C  3.71723667 -0.81964496 0.02220782
H  4.25699519 -1.46437616 0.72092652
H  4.37034526 0.01624926 -0.24116392
C  3.21729784 -1.54789308 -1.21859303
C  2.50736881 -2.81672773 -0.78242075
H  3.18317902 -3.53398536 -0.30925272
H  2.02724377 -3.31566187 -1.62497815
C  2.66507998 0.59345859 1.85705975
H  3.32999662 0.03015971 2.52135542
H  3.23484011 1.47185958 1.54559274
C  2.18691419 1.77102597 -0.87096776
O  3.06572487 2.06425029 -1.64929146
O  1.64232594 2.66432842 -0.04182348
C  2.13354022 4.01678426 -0.13966259
H  3.19800922 4.04157415 0.09067804
H  1.95868158 4.40316965 -1.14312144
H  1.56650946 4.5800995 0.59650387
C  2.23384309 -0.54470653 -1.83959759
H  2.76803814 0.11006333 -2.52589611
H  1.43793936 -1.02196218 -2.40955861
H  4.01598727 -1.81739245 -1.91159429
C  1.65962453 0.32968468 -0.6788027
C  1.47672237 1.05161942 2.68735481
H  1.81666083 1.84074549 3.36703792
H  0.68306616 1.46859399 2.06151232
O  0.98544705 -0.06054192 3.43428751
H  0.22035325 0.22463889 3.94465918
H  0.68107558 -1.27554113 1.63945949
