program: Gaussian 16
title: Molecule Name
version: ES64L-G16RevC.01
method: RmPW1PW91
basis: 6-31+G(d,p)
operation: Freq
keyword: #N
keyword: Geom=AllCheck
keyword: Guess=TCheck
keyword: SCRF=Check
keyword: GenChk
keyword: RmPW1PW91/6-31+G(d,p)
keyword: Freq
converged: YES YES YES YES
title: Mulliken charges:
elementType: C C C C C C C C H H H O C H H H N H C H H C H H N C H C C H H C C H H C H H C O O C H H H C H H H C C H H O H
charge: 2.188970 -1.299795 -0.470197 0.332618 -0.445618 -0.797059 0.578229 0.213189 0.176822 0.174587 0.173575 -0.319975 -0.207711 0.168584 0.176654 0.168127 0.017948 0.329537 -0.392186 0.179171 0.180731 -0.125594 0.175647 0.185111 0.084297 -0.234727 0.206695 -0.072203 -0.665814 0.263976 0.290547 -0.059366 -0.170726 0.175395 0.176011 -0.397139 0.253202 0.270850 -0.534748 -0.241144 -0.069416 -0.161685 0.210341 0.192920 0.188241 -0.473898 0.218071 0.204537 0.199789 -0.212860 -0.178318 0.171539 0.186964 -0.608261 0.425565
chargesum: 1.00000
title: Mulliken charges with hydrogens summed into heavy atoms:
elementType: C C C C C C C C O C N C C N C C C C C C C O O C C C C O
charge: 2.188970 -1.299795 -0.293375 0.507205 -0.445618 -0.623484 0.578229 0.213189 -0.319975 0.305653 0.347485 -0.032284 0.235164 0.084297 -0.028031 -0.072203 -0.111291 0.140423 0.180681 0.126913 -0.534748 -0.241144 -0.069416 0.429818 -0.051290 -0.212860 0.180185 -0.182697
1716.lowfreq: -102.7591 -0.0010 -0.0005 -0.0003 3.1468 4.9780 13.4185 30.2707 55.9068
frequency: -102.7189 29.9871 55.8253 60.1470 65.3802 77.1011 96.5848 106.8552 113.3983 123.5453 136.4234 163.0416 190.0992 201.8267 205.6366 210.3787 227.6208 233.0888 263.1321 268.3892 273.5847 278.9988 287.3846 298.0655 332.7742 349.2616 353.4781 375.3722 385.9236 391.4020 410.5209 414.9823 430.9494 437.3172 451.0043 480.7998 502.8134 509.7447 526.3582 571.9280 578.9868 603.7285 623.2669 628.9390 662.4981 693.6211 703.4314 716.2165 739.4534 751.6579 761.2097 793.8938 812.8445 824.5736 841.1635 859.4241 871.4382 876.3232 890.7274 905.0970 927.1197 943.0434 946.6198 951.6709 965.4197 976.9582 982.4499 997.6578 1017.2420 1028.6467 1048.9074 1058.5098 1082.6143 1084.6736 1101.6691 1112.8570 1129.2258 1141.6345 1153.6270 1168.1353 1177.9381 1178.5446 1187.4213 1194.9472 1204.5785 1210.9781 1215.4423 1222.6606 1236.2580 1237.9151 1245.9572 1252.3794 1267.8808 1274.0271 1276.7671 1286.1504 1292.4632 1302.0312 1315.9202 1328.7275 1340.5104 1348.2343 1351.5266 1358.8926 1362.4383 1375.0431 1379.2454 1393.8632 1405.2009 1413.0447 1432.1278 1434.3429 1464.3144 1473.0849 1480.3648 1481.6627 1482.7333 1488.2985 1492.8128 1493.8591 1495.1971 1498.7055 1507.4626 1509.1147 1515.3145 1527.4327 1536.3771 1543.0104 1585.7221 1646.7721 1701.5797 1815.0423 2988.3314 3015.0525 3046.1853 3047.6759 3049.4026 3051.2258 3059.3694 3076.7670 3097.8604 3103.1839 3108.3816 3112.2121 3115.5036 3121.1278 3124.4122 3131.5397 3148.0811 3168.0250 3178.4771 3190.1532 3202.3638 3228.1585 3228.8636 3235.9805 3260.6140 3733.3033 3891.3063
redmass: 4.7188 4.6539 5.6043 5.6083 4.4211 3.8326 4.8392 4.1294 3.8807 3.7357 3.1658 3.3210 2.9107 3.3054 1.2956 3.1621 3.4158 2.2994 2.6589 1.5850 2.9464 3.7169 1.1591 3.0301 2.8559 2.0612 2.6163 2.3530 3.0376 1.8430 2.3299 3.4713 3.6557 2.9859 2.9215 3.3364 4.8711 3.3245 3.6680 4.0677 3.3561 3.7331 3.3344 3.9718 5.0461 2.2251 5.6491 4.6767 5.1187 4.6894 4.1004 5.4735 1.6142 3.3888 4.7559 2.7844 2.7034 1.5477 2.9810 3.0785 2.8566 2.3123 1.3267 1.8571 3.0089 3.1284 2.6793 2.6370 1.6822 2.3037 2.3665 2.2770 2.5724 2.0336 2.2491 2.7818 1.9330 1.9387 2.2523 1.4297 2.0527 1.3062 1.5528 1.2796 1.4302 1.4407 1.4728 1.5443 1.5335 1.3574 1.5739 1.8434 1.7742 1.5940 1.6291 1.8828 1.2999 2.6276 1.5956 1.9418 1.7825 1.2026 1.2303 1.4655 3.8825 1.8053 1.7404 1.4712 1.3802 1.5240 4.1378 1.9303 1.6227 1.1799 1.3736 1.6757 1.2174 1.4098 1.0614 1.7949 1.3564 1.0445 1.3855 1.1008 1.5708 1.0852 1.0883 4.3888 6.7983 5.7762 7.2007 11.7085 1.0714 1.0661 1.0831 1.0727 1.0339 1.0695 1.0606 1.0611 1.0870 1.0296 1.1000 1.1029 1.0925 1.0616 1.1066 1.1061 1.0878 1.0898 1.1058 1.1011 1.1085 1.0910 1.1082 1.0913 1.0922 1.0795 1.0668
irintensity: 122.0762 2.8567 2.2933 4.5548 3.7511 2.5053 8.8217 20.9701 4.8778 11.8147 3.4958 7.3740 3.3687 1.4998 2.3410 3.3715 20.3619 1.9130 7.5142 6.0968 27.8362 14.1665 136.0799 31.5619 31.2605 32.1511 29.0251 81.3534 0.7519 77.2286 13.5599 46.1560 6.5496 21.7471 4.7051 5.2685 20.1790 19.7989 15.3571 16.1945 117.6656 8.7551 38.7135 27.2823 74.6039 25.1486 13.9720 5.2284 7.4335 37.5139 0.9824 34.1124 48.2524 26.4984 3.2786 33.4698 200.0565 28.8435 58.7801 78.5917 1.5542 11.7720 2.2315 22.9182 24.6084 9.5874 34.6481 9.7588 30.5766 25.2334 13.6825 32.8081 15.0566 54.1956 114.5464 91.0029 59.6288 16.8327 138.8655 8.5075 16.9852 1.3051 179.0246 0.3126 48.1112 68.2519 38.8310 44.3554 147.0093 8.5717 27.0411 213.1397 30.5003 168.8086 42.6070 152.0642 161.3017 187.8704 146.9904 355.0041 127.3180 138.1213 59.9541 3.0933 14.3580 14.9473 13.1160 33.8038 30.9456 3.8225 26.0940 2.4941 4.8193 17.5284 17.0296 118.2800 28.1759 77.8087 7.4252 25.8496 19.8715 13.8064 16.4045 97.5997 35.3280 10.7266 11.0611 146.0191 309.7942 65.1259 31.2323 362.0069 81.5067 94.2370 30.0376 11.0871 111.2359 77.7917 66.6627 50.9354 18.8161 33.5950 10.5633 16.4355 27.9176 14.6391 41.9002 27.2103 21.9433 1.9965 2.0842 25.7468 3.8013 7.8891 5.8136 8.8564 6.0563 126.1783 127.8147
temp: 298.150 k
press: 1.00000 atm
elementType: 6 6 6 6 6 6 6 6 1 1 1 8 6 1 1 1 7 1 6 1 1 6 1 1 7 6 1 6 6 1 1 6 6 1 1 6 1 1 6 8 8 6 1 1 1 6 1 1 1 6 6 1 1 8 1
symmnumber: 1
zpe: 1225001.0 jmol-1
zpe.correction: 0.466578 hartree
zpe.thermalcorrener: 0.491229 hartree
zpe.thermalcorrenthalpy: 0.492173 hartree
zpe.thermalcorrgfe: 0.413955 hartree
zpe.sumelectzpe: -1264.082958 hartree
zpe.sumelectthermal: -1264.058307 hartree
zpe.sumelectthermalent: -1264.057363 hartree
zpe.sumelectthermalfe: -1264.135581 hartree
dipole: 13.1120 0.1407 -3.0943
dipole: 13.4729
quadrupole: -69.4841 -131.4327 -157.5158
quadrupole: 12.1405 -12.6239 7.4651
quadrupole: 49.9934 -11.9551 -38.0383 12.1405 -12.6239 7.4651
hfenergy: -1264.5495358 hartree
pointgroup: C01 [X(C22H27N2O4)]
dipole: 5.1570035 0.0531474 -1.2244061 debye
polarizability: 639.9502899|28.84586|335.0169016|-8.4607581|-7.1215989|246.7453891 unknown
InChI: InChI=1S/C22H27N2O4/c1-27-15-3-4-18-17(10-15)16-5-7-24-12-13-9-14(6-8-25)20(24)22(11-13,19(16)23-18)21(26)28-2/h3-4,10,13,20,23,25H,5-9,11-12H2,1-2H3
charge 1 multiplicity 1
55 atoms
C  -2.67643246 0.32416066 0.02218194
C  -2.50047274 -1.05837841 0.26996405
C  -3.57561603 -1.942962 0.2973525
C  -4.84611432 -1.43130496 0.0683245
C  -5.04072675 -0.05412408 -0.18172857
C  -3.96612729 0.82534163 -0.20667872
C  -1.38116387 0.93456172 0.06761337
C  -0.47842105 -0.08011748 0.348652
H  -3.43715065 -3.00130542 0.48924976
H  -5.6897508 -2.10892515 0.08273084
H  -4.1492753 1.87648199 -0.39934587
O  -6.26636711 0.49729533 -0.41091361
C  -7.40474772 -0.34362076 -0.37998748
H  -7.52772096 -0.8158733 0.60040333
H  -8.25846858 0.30353407 -0.57500297
H  -7.35456744 -1.11548293 -1.15524089
N  -1.15794277 -1.27433023 0.45798222
H  -0.74783227 -2.17542463 0.6341705
C  -1.10503695 2.39136601 -0.13704547
H  -2.00074944 2.86627278 -0.54846297
H  -0.93431965 2.89053666 0.82615422
C  0.04929003 2.68329048 -1.09329148
H  -0.1553781 2.22447558 -2.06570069
H  0.12050656 3.76278559 -1.2590499
N  1.37221113 2.24234349 -0.66370816
C  1.62056065 0.8189441 -0.72773378
H  1.20102463 0.40044382 -1.64179157
C  3.06284859 0.5837143 -0.58991758
C  3.62386712 1.12296448 0.64722624
H  4.47867025 1.76969907 0.39000949
H  4.09398554 0.28010754 1.18297223
C  2.53433867 1.84527794 1.4325277
C  1.93506435 2.91131247 0.51726008
H  2.69053 3.64574486 0.21062632
H  1.15587537 3.45367656 1.06130071
C  3.82925302 -0.12709328 -1.61079569
H  3.20807714 -0.92191306 -2.04069615
H  3.89170488 0.61738604 -2.42944912
C  1.60414052 -1.40134459 0.67483346
O  2.09868298 -1.86455958 1.67609251
O  1.49595232 -2.06541041 -0.47819346
C  2.02721428 -3.40665545 -0.49273266
H  3.10070427 -3.37550229 -0.30690953
H  1.53271799 -4.01310725 0.26594103
H  1.81297481 -3.7878331 -1.48781861
C  1.41710006 0.85511979 1.79974469
H  1.73905002 0.17661215 2.59074436
H  0.55459733 1.41089275 2.17030672
H  2.95013146 2.30108359 2.33223139
C  1.00701166 0.01359616 0.56679895
C  5.21463006 -0.61923214 -1.23768572
H  5.85344201 0.2149882 -0.92346835
H  5.67038811 -1.07569724 -2.12224018
O  5.04811483 -1.55941987 -0.19270752
H  5.90710361 -1.91517418 0.05771859
