program: Gaussian 16
title: Molecule Name
version: ES64L-G16RevC.01
method: RB3LYP
basis: 6-311+G(d,p)
operation: Freq
keyword: #N
keyword: Geom=AllCheck
keyword: Guess=TCheck
keyword: SCRF=Check
keyword: GenChk
keyword: RB3LYP/6-311+G(d,p)
keyword: Freq
converged: YES YES NO YES
title: Mulliken charges:
elementType: C C C H H C H H N C H C C H H C C H H C H H H C N H H C C C C C C H H O C H H H C O O C H H H C H H C H H O H
charge: 0.571999 0.702313 -0.620110 0.197997 0.199386 -0.281999 0.190307 0.197696 0.171491 -0.396051 0.163835 0.793469 -0.940753 0.200378 0.189927 0.377403 -0.562713 0.186813 0.184330 -0.731990 0.197621 0.152601 0.175651 -0.095370 -0.012749 0.357994 0.155441 -0.703748 -0.971943 0.398925 0.194735 0.924873 -0.828475 0.173372 0.149145 -0.207999 -0.271912 0.166808 0.175476 0.166670 -0.065834 -0.278817 -0.063522 -0.211233 0.177625 0.178817 0.174486 -0.192143 0.180814 0.165952 -0.408845 0.159427 0.154809 -0.345873 0.283493
chargesum: 1.00000
title: Mulliken charges with hydrogens summed into heavy atoms:
elementType: C C C C N C C C C C C C N C C C C C C O C C O O C C C O
charge: 0.571999 0.702313 -0.222726 0.106003 0.171491 -0.232215 0.793469 -0.550448 0.553054 -0.191569 -0.381769 -0.095370 0.345245 -0.548307 -0.822798 0.572297 0.194735 0.924873 -0.828475 -0.207999 0.237042 -0.065834 -0.278817 -0.063522 0.319695 0.154623 -0.094609 -0.062380
1716.lowfreq: -5.0777 -3.4780 -0.0007 -0.0004 0.0004 3.4989 21.7958 28.9936 46.1729
frequency: 21.4007 28.9809 46.1425 46.7278 53.3354 70.4155 74.1996 81.0902 100.1442 106.9630 128.3763 155.3219 164.6805 178.8791 181.9549 198.2445 205.6265 242.6861 244.6514 264.4846 267.6008 274.9314 304.6675 313.7129 326.0933 344.2006 369.5363 381.2454 403.5027 408.5902 425.4619 436.5269 450.6452 456.1590 470.9440 503.7468 517.7730 527.8162 560.8162 567.0545 584.1188 592.1000 607.9695 620.8716 641.0746 677.5297 703.4619 721.3023 730.1836 756.1234 778.8817 793.8849 812.2579 816.6440 827.9421 837.2989 847.7589 854.8529 867.5412 880.2326 895.1546 901.6914 920.6406 927.8141 943.0696 957.6742 968.1883 983.9610 987.0945 1032.0023 1034.7257 1044.6786 1058.0145 1062.9702 1066.3621 1088.5197 1127.9231 1134.3869 1159.7391 1167.1267 1169.2162 1169.8960 1183.1091 1188.5080 1199.4485 1201.1138 1207.9934 1212.5309 1221.0683 1234.1531 1240.1020 1251.4448 1260.9183 1269.2279 1270.2480 1290.5301 1299.4827 1310.8305 1317.1514 1330.2505 1334.9504 1349.9747 1356.9254 1369.1428 1369.4530 1378.5969 1395.7274 1414.2883 1423.4677 1432.8710 1437.2945 1440.0742 1462.5296 1463.1994 1467.7172 1470.9809 1475.1314 1479.4377 1483.7027 1486.3021 1488.6072 1491.7898 1496.7942 1501.3071 1517.7144 1526.2546 1542.3869 1595.2080 1599.9593 1638.7936 1663.4261 1687.4786 3007.7832 3013.7501 3019.0011 3023.0798 3030.1828 3032.7297 3044.0118 3059.8432 3063.2970 3068.6613 3073.0315 3075.5833 3090.4768 3111.2478 3121.0314 3127.3198 3138.0098 3149.8984 3150.0049 3160.8733 3163.5401 3174.6015 3201.7632 3205.8915 3221.8286 3551.9108 3830.9947
redmass: 4.9601 4.2727 3.8518 4.5932 4.0648 4.5814 5.1598 4.3000 4.9158 4.7739 2.9628 1.3785 3.4024 3.0319 3.2055 3.3239 3.6099 1.1737 1.2229 4.0725 3.5716 3.2964 2.5827 3.7947 2.5073 2.3971 4.7232 4.4844 3.1788 3.3731 2.9251 4.2095 3.3865 3.8405 2.9794 4.2231 3.4688 3.7881 3.6369 3.6422 2.7106 2.7104 3.1659 1.5613 2.8911 4.7011 4.4566 3.9590 5.2108 3.8547 4.6451 4.1416 3.0209 4.6331 1.6322 4.1621 2.8286 2.4618 1.6497 2.3826 2.3983 2.4242 1.8727 2.4806 2.3882 2.4170 1.3413 2.3704 3.7145 2.7752 2.6774 3.0483 2.1737 2.7273 3.3571 2.1088 2.5800 2.5723 2.2075 1.2686 1.2778 1.6053 1.5051 1.6196 1.4939 1.2751 1.4129 1.7269 1.5001 1.5870 1.6006 1.1795 1.6722 1.7058 2.5553 1.3941 1.1988 1.5185 1.6033 1.9410 1.3568 1.8348 1.4404 1.8168 1.4805 2.0246 1.9699 1.5899 2.5670 2.0245 1.9849 1.6218 1.1305 1.6063 1.1967 1.1456 1.0439 1.3145 1.0673 1.1290 1.0445 1.3350 1.0692 1.1600 1.0831 1.1944 5.1811 4.9124 6.3179 5.3753 7.0206 9.0232 1.0573 1.0618 1.0618 1.0333 1.0723 1.0932 1.1074 1.0295 1.0627 1.0857 1.0673 1.0983 1.1076 1.0965 1.0650 1.1013 1.1079 1.0990 1.1011 1.0909 1.0961 1.1066 1.0917 1.0901 1.0934 1.0822 1.0667
irintensity: 2.2478 0.2702 1.4483 0.8684 0.5401 0.2043 9.1468 5.3018 6.2683 3.8229 5.2565 1.2334 4.9471 16.0926 6.5269 20.4908 1.3886 157.0811 1.3008 12.3677 3.2236 15.6936 11.5810 16.7865 6.6180 4.9913 3.4985 36.1607 12.3512 1.3568 16.2756 3.2162 5.6991 6.2485 76.6292 24.1147 59.1089 32.6142 106.3696 47.5936 27.6972 1.9521 9.5977 133.8722 10.3138 85.3679 7.6304 56.8110 8.4915 85.0470 29.6052 51.2567 37.4668 99.2324 47.3399 425.4180 135.3708 6.5506 21.1084 17.3044 35.0085 18.6188 3.8219 33.2670 27.3906 50.6147 0.5769 28.5777 1.3713 61.1722 10.5254 122.8875 91.9341 238.9650 16.3572 48.8129 95.4114 205.8840 401.9167 1.7156 2.2536 21.0997 31.3604 194.2982 407.5723 163.8267 315.1989 519.0488 14.2006 566.6738 20.2053 4.5939 153.6498 90.7283 604.7515 445.0070 58.3053 38.4591 258.8808 352.2295 38.5418 39.1225 24.1011 17.7377 13.4951 66.5793 12.2884 60.8025 108.0770 6.4666 36.2838 84.8515 47.4305 266.8320 39.7403 22.1783 16.0851 36.4810 33.6527 33.4540 15.3029 28.5147 104.9550 12.2478 3.5498 82.4821 401.2309 244.1770 534.5112 667.9180 72.1403 255.4553 49.3863 0.6301 82.6238 112.6224 44.8514 23.4617 55.2357 44.6604 56.3752 75.6285 42.6680 53.0795 44.0767 18.9580 42.6572 11.2887 21.0802 23.8659 21.0725 42.9490 12.4342 18.0679 8.8657 5.9601 3.0893 476.1346 89.8278
temp: 298.150 k
press: 1.00000 atm
elementType: 6 6 6 1 1 6 1 1 7 6 1 6 6 1 1 6 6 1 1 6 1 1 1 6 7 1 1 6 6 6 6 6 6 1 1 8 6 1 1 1 6 8 8 6 1 1 1 6 1 1 6 1 1 8 1
symmnumber: 1
zpe: 1215993.0 jmol-1
zpe.correction: 0.463147 hartree
zpe.thermalcorrener: 0.489046 hartree
zpe.thermalcorrenthalpy: 0.489990 hartree
zpe.thermalcorrgfe: 0.406793 hartree
zpe.sumelectzpe: -1264.805426 hartree
zpe.sumelectthermal: -1264.779527 hartree
zpe.sumelectthermalent: -1264.778583 hartree
zpe.sumelectthermalfe: -1264.861780 hartree
dipole: 1.0784 -0.6446 0.2990
dipole: 1.2914
quadrupole: -96.7629 -156.9288 -129.6959
quadrupole: 5.5787 7.0811 3.3541
quadrupole: 31.0330 -29.1330 -1.9001 5.5787 7.0811 3.3541
hfenergy: -1265.268573 hartree
pointgroup: C01 [X(C22H27N2O4)]
dipole: 0.3945639 -0.2973375 0.1185799 debye
polarizability: 643.0429658|32.490299|484.7416726|53.1055582|64.4176222|397.2760538 unknown
InChI: InChI=1S/C22H27N2O4/c1-27-16-3-4-20-18(11-16)17-5-7-24-12-14(6-8-25)9-15(13-24)10-19(21(17)23-20)22(26)28-2/h3-4,11-12,15,23,25H,5-10,13H2,1-2H3
charge 1 multiplicity 1
55 atoms
C  -0.76979294 -0.47223246 1.26573611
C  0.20801808 -1.21445797 0.44929239
C  -0.63146028 0.08471385 2.6260149
H  -1.5909466 -0.00531303 3.13972645
H  0.09831048 -0.46112709 3.21588766
C  -0.26694844 1.62936817 2.67837724
H  -1.16013759 2.18948992 2.39627125
H  -0.01101255 1.87671811 3.70767473
N  0.79835344 1.99760324 1.79251532
C  0.4775274 1.97985372 0.45482918
H  -0.51847503 2.33587101 0.21397581
C  1.31475793 1.55303425 -0.52124378
C  2.64629103 0.95179256 -0.1871196
H  3.44217906 1.62795917 -0.5190148
H  2.78417511 0.0508058 -0.79724004
C  2.83554925 0.62270253 1.31331114
C  2.189424 1.73864388 2.1496637
H  2.75639306 2.65926184 1.97666767
H  2.24025449 1.51447377 3.21469908
C  2.33940604 -0.80773462 1.74077918
H  3.21100184 -1.4166147 1.96215402
H  1.77745632 -0.73265799 2.66634071
H  3.90562123 0.65668021 1.52470538
C  1.53698355 -1.49692099 0.6791671
N  -0.46733015 -1.62004464 -0.6985091
H  -0.00603679 -2.17343213 -1.41077231
H  -2.60441454 -1.83961234 -2.56196848
C  -2.76497753 -1.30694086 -1.63422433
C  -3.23585993 0.10293375 0.81035954
C  -3.99113833 -0.7343135 -1.34867911
C  -1.75043822 -1.17254173 -0.68429979
C  -1.97186273 -0.46250039 0.53674901
C  -4.23456666 -0.02983607 -0.13255203
H  -4.78515897 -0.83437587 -2.07507605
H  -3.43471949 0.6357939 1.73093369
O  -5.43639379 0.53566073 0.16523304
C  -6.50364494 0.44587458 -0.78393079
H  -6.23483593 0.9298857 -1.72653706
H  -7.34026099 0.97309634 -0.33166822
H  -6.78457563 -0.59486935 -0.96511894
C  2.25287821 -2.3850972 -0.27593971
O  1.75702534 -2.91268114 -1.26217646
O  3.5350566 -2.56340972 0.06005745
C  4.32185061 -3.39872174 -0.81733478
H  4.34697574 -2.96777893 -1.81794967
H  5.31567412 -3.41464916 -0.37930301
H  3.90013771 -4.40254418 -0.85667331
C  0.90517399 1.62355382 -1.96204617
H  0.92831986 0.61443463 -2.39182787
H  -0.12224707 1.9883913 -2.04125261
C  1.81164223 2.49972247 -2.82512394
H  1.46541397 2.45778102 -3.86332794
H  2.84240123 2.12928557 -2.79614895
O  1.7511495 3.84191591 -2.32941844
H  2.32182368 4.39309002 -2.8753095
