program: Gaussian 09
title: 000033794
version: EM64L-G09RevD.01
frameworkgroup: C1[X(C13H12Cl2O4)]
method: RPBEPBE
basis: SDD
operation: Freq
keyword: #p
keyword: freq=noraman
keyword: PBEPBE/SDD
title: #p freq=noraman PBEPBE/SDD
converged: YES YES NO NO
title: Mulliken charges:
elementType: Cl Cl O O O O C C C C C C C C C C C C C H H H H H H H H H H H H
charge: 0.051288 0.051829 -0.168193 -0.217032 -0.424204 -0.176679 -0.138396 -0.612014 0.389198 0.001235 0.263865 -0.402993 -0.574693 -0.285074 -0.705915 0.517834 -0.409654 -0.337829 0.162585 0.249147 0.242897 0.241346 0.206710 0.245752 0.266174 0.218523 0.213492 0.225124 0.255237 0.255100 0.395340
chargesum: 0.00000
title: Mulliken charges with hydrogens summed into heavy atoms:
elementType: Cl Cl O O O O C C C C C C C C C C C C C
charge: 0.051288 0.051829 -0.168193 -0.217032 -0.028865 -0.176679 0.110751 -0.127770 0.389198 0.001235 0.263865 0.049468 -0.308520 -0.285074 -0.048775 0.517834 -0.409654 0.172508 0.162585
polarizability: 2.54054256e+02 -4.68287904e+00 2.01141377e+02 -2.24568564e+00 3.26925038e+00 8.73819909e+01
1716.lowfreq: -5.3116 -3.0059 -0.0015 -0.0007 0.0022 3.8422 21.4229 28.9653 33.7557
frequency: 21.3927 28.8967 33.7426 61.9633 67.8431 86.2362 92.9281 128.1499 140.6897 171.7508 191.5796 193.4648 200.4085 223.3051 234.6231 250.5144 287.1972 319.0398 332.6739 374.1549 392.7838 424.2222 482.2872 512.8886 533.0390 543.3541 575.7202 590.6002 605.0115 628.5092 630.4207 676.4480 699.9723 748.0479 774.9264 806.9976 834.8284 849.3491 878.9277 880.8387 939.1403 956.9181 980.9055 1004.8943 1033.0302 1033.7379 1058.0121 1069.8692 1104.6080 1134.1729 1140.6517 1174.6403 1201.4977 1206.5774 1221.9942 1249.2389 1255.0831 1273.4322 1287.9172 1305.3996 1332.6095 1366.2169 1384.0369 1391.9998 1398.9740 1431.6886 1450.5074 1457.1597 1473.1996 1478.4236 1484.9038 1561.6191 1591.8683 1635.1247 1710.6995 2966.4432 2973.6871 2974.4965 2984.3777 2985.0193 3035.2899 3039.3964 3046.1379 3070.7632 3075.3824 3158.2496 3529.3220
redmass: 11.4867 4.1114 8.3134 6.5694 9.8226 3.9637 3.2507 2.7012 3.2655 5.6485 8.6849 4.5571 19.6467 1.3741 9.4319 3.4630 4.7690 10.7483 5.7482 3.4590 6.6547 5.0689 5.7145 1.8057 4.3027 4.3124 5.6212 5.3673 7.3234 1.5491 4.3013 7.1527 6.8090 4.0139 1.3993 3.3715 3.5255 1.8995 3.6814 3.7080 1.5082 5.4896 1.9487 1.8702 3.6081 4.3236 2.0483 4.0159 1.8524 2.1724 5.5026 1.3853 1.5005 1.0769 1.3953 1.3426 1.5926 2.0075 3.2481 1.5167 1.5082 2.4255 5.7353 1.2220 3.8764 2.3831 1.0879 1.3520 1.0610 1.0457 1.0700 8.4535 8.1836 12.1203 9.5033 1.0795 1.0362 1.0551 1.0654 1.0629 1.1045 1.0987 1.0987 1.1006 1.0992 1.0913 1.0644
irintensity: 0.8637 0.0135 0.3241 0.6967 2.4210 0.2483 0.3193 6.8808 3.8678 0.2519 1.3466 0.5992 0.2686 0.1521 0.6057 0.1214 5.6504 0.8420 1.0496 0.7297 2.7937 16.5678 12.9967 45.5168 5.5587 0.1230 28.1568 5.4030 13.6620 129.3083 25.4373 1.0046 30.1700 10.3326 6.9613 2.1127 14.3933 27.1235 8.9080 12.6277 15.9220 73.6766 17.5673 0.1607 256.2260 226.4317 1.5263 0.8879 4.3784 59.7297 116.6124 8.7617 13.0162 0.9725 0.4475 53.1918 88.3605 76.0771 157.9094 23.3136 10.8675 0.5883 51.3854 18.7652 86.3333 59.7391 18.1619 17.0823 3.0128 10.2567 12.8427 52.2741 401.1352 117.9719 197.6273 3.8100 31.2597 38.1712 24.0731 22.3979 11.9835 1.4500 13.5267 62.7077 46.4679 9.9403 45.2203
temp: 298.150 k
press: 1.00000 atm
elementType: 17 17 8 8 8 8 6 6 6 6 6 6 6 6 6 6 6 6 6 1 1 1 1 1 1 1 1 1 1 1 1
symmnumber: 1
zpe: 586942.0 jmol-1
zpe.correction: 0.223554 hartree
zpe.thermalcorrener: 0.242423 hartree
zpe.thermalcorrenthalpy: 0.243367 hartree
zpe.thermalcorrgfe: 0.173484 hartree
zpe.sumelectzpe: -1722.194905 hartree
zpe.sumelectthermal: -1722.176036 hartree
zpe.sumelectthermalent: -1722.175092 hartree
zpe.sumelectthermalfe: -1722.244976 hartree
dipole: -1.7037 -7.9984 -0.3307
dipole: 8.1846
quadrupole: -124.0072 -121.9786 -122.0012
quadrupole: 3.8972 0.1798 0.1466
quadrupole: -1.3449 0.6837 0.6611 3.8972 0.1798 0.1466
hfenergy: -1722.4184595 hartree
pointgroup: C01 [X(C13H12Cl2O4)]
dipole: -0.6946917 3.1434178 0.0714357 debye
polarizability: 253.9354945|5.1086483|201.2938549|3.4680002|1.4015686|87.3482748 unknown
InChI: InChI=1S/C13H12Cl2O4/c1-2-6-3-7-4-8(19-5-9(16)17)11(14)12(15)10(7)13(6)18/h4,6,16H,2-3,5H2,1H3
charge 0 multiplicity 1
31 atoms
Cl 1.243483 -3.495487 0.011544
Cl -1.958579 -2.972457 -0.115088
O  3.782503 -1.597281 0.113083
O  -2.705635 -0.173134 -0.082443
O  -5.349261 2.308241 -0.116847
O  -5.474634 -0.021602 -0.192199
C  3.363057 0.844378 0.340533
C  2.052454 1.65316 0.130033
C  0.945252 0.60911 0.089829
C  2.963237 -0.645162 0.166223
C  1.473989 -0.706378 0.087845
C  4.548698 1.24062 -0.570785
C  -0.438967 0.841505 0.033251
C  0.594626 -1.815327 0.018558
C  5.126626 2.630924 -0.233713
C  -1.316663 -0.269389 -0.027995
C  -0.795753 -1.601311 -0.036761
C  -3.284223 1.163193 -0.074925
C  -4.799656 1.016097 -0.135161
H  3.696663 0.947599 1.395031
H  2.088432 2.206398 -0.829336
H  1.878124 2.402895 0.922822
H  4.217245 1.2143 -1.628417
H  5.331776 0.466279 -0.466844
H  -0.823617 1.865194 0.034905
H  4.364288 3.426603 -0.334015
H  5.50803 2.6595 0.804496
H  5.964718 2.88525 -0.907378
H  -3.016373 1.716861 0.846939
H  -2.949422 1.755463 -0.949834
H  -6.341915 2.252662 -0.157148
