program: Gaussian 16
title: wamser cis sm 631gd
version: ES64L-G16RevC.01
method: RB3LYP
basis: GenECP
operation: Freq
keyword: #N
keyword: Geom=AllCheck
keyword: Guess=TCheck
keyword: SCRF=Check
keyword: GenChk
keyword: RB3LYP/GenECP
keyword: Freq
converged: YES YES NO YES
title: Mulliken charges:
elementType: C C O C H C O Rh Rh O O O O O O O O C C C C C H H H C H H H C H H H C H H H C C C C H C C H H H H C H H H H C H H H I
charge: -0.511875 0.694246 -0.415535 0.042147 0.251390 -0.107853 -0.386209 0.500919 0.503838 -0.490879 -0.498071 -0.497404 -0.492311 -0.490224 -0.509268 -0.487632 -0.503949 0.671696 0.665722 0.670415 0.669478 -0.530983 0.184462 0.173997 0.193144 -0.537284 0.188608 0.183788 0.173962 -0.534061 0.185421 0.183117 0.184092 -0.536028 0.185418 0.183825 0.190262 0.249166 -0.159112 -0.363454 -0.130571 0.200251 -0.080354 -0.121742 0.141623 0.148705 0.139327 0.210744 -0.462045 0.164091 0.152088 0.187380 0.216137 -0.471784 0.199650 0.145289 0.150540 0.133690
chargesum: -0.00000
title: Mulliken charges with hydrogens summed into heavy atoms:
elementType: C C O C C O Rh Rh O O O O O O O O C C C C C C C C C C C C C C C C I
charge: -0.260486 0.694246 -0.415535 0.252891 0.108284 -0.386209 0.500919 0.503838 -0.490879 -0.498071 -0.497404 -0.492311 -0.490224 -0.509268 -0.487632 -0.503949 0.671696 0.665722 0.670415 0.669478 0.020620 0.009073 0.018569 0.023477 0.249166 0.041138 -0.363454 0.011052 0.068352 0.017586 0.041514 0.023696 0.133690
1716.lowfreq: -625.2815 -3.1622 0.0004 0.0005 0.0008 2.5103 6.5843 19.2422 27.0674
frequency: -625.2815 19.1492 27.0547 36.2188 37.9355 39.3683 43.2866 44.2486 50.5572 56.7051 60.0384 62.4401 67.2471 74.0071 76.7638 88.3978 95.3106 102.3889 110.4902 119.7833 130.4403 136.6042 140.8585 158.4259 159.7438 177.5538 205.3582 208.5847 215.4357 216.3342 231.3369 237.6337 238.8472 241.2898 242.4679 243.0837 254.6590 271.5804 285.0225 285.6690 291.6996 306.6137 311.7811 319.3189 330.8043 345.6857 363.5554 368.2540 374.4644 380.5721 399.7496 444.0931 464.4190 482.5490 526.8989 571.7603 573.2562 580.6865 587.1797 593.6789 605.9669 620.1423 620.8426 622.1277 647.3748 685.0028 697.7343 700.2674 705.8659 717.0694 724.2814 724.7339 751.1861 781.3952 853.9615 866.0570 877.5917 913.1979 942.1020 952.3330 953.4230 956.0043 962.8381 966.8212 967.9781 989.9114 992.0790 1011.3205 1048.2467 1053.7628 1055.3161 1055.7151 1056.7632 1075.0758 1077.0018 1077.3657 1078.5611 1087.9136 1104.8124 1152.6988 1165.4111 1181.6443 1196.9085 1206.0492 1213.9398 1248.6637 1288.2551 1322.6650 1335.2206 1343.5898 1353.5361 1400.6022 1401.9412 1402.4061 1406.1487 1419.6229 1445.4869 1454.3724 1456.1718 1457.7942 1458.7232 1465.5612 1466.8348 1487.9097 1488.9777 1490.5069 1493.9086 1505.2721 1506.8923 1507.4050 1508.6548 1511.2748 1515.3992 1523.1676 1533.3500 1550.3339 1577.1165 1579.5662 1604.4500 1609.2343 1636.9562 1670.5550 1873.1004 2055.3395 3051.4371 3054.3322 3065.5025 3067.1682 3067.3132 3067.4048 3089.2178 3112.9685 3122.4847 3128.7377 3132.1906 3135.8680 3136.6387 3136.7126 3153.0823 3174.0164 3174.7576 3175.6397 3177.1591 3178.8133 3192.8413 3208.5549 3223.6039 3256.5342
redmass: 1.6965 4.8162 8.8996 1.1049 1.1329 1.0791 5.1925 3.6183 1.8285 3.5988 3.1968 3.4068 2.8639 9.2246 2.9964 6.8717 3.2504 4.4518 4.6918 3.9780 5.4926 5.2544 5.7615 14.5585 11.5567 4.6647 4.0365 11.4940 6.3036 5.3919 5.6584 5.6199 6.4320 3.6489 1.9654 2.6682 1.3569 5.0187 7.8374 7.4954 4.3470 9.0759 6.7805 5.5615 6.3237 4.5243 4.6595 7.1562 3.8480 3.9407 3.9956 3.3992 3.2167 5.6927 3.5337 4.8370 4.8023 5.0699 5.1516 5.3041 2.9101 2.9911 3.0669 3.0517 6.6760 6.6883 7.7583 7.7078 7.1053 7.5137 6.4093 5.2846 2.0728 2.1409 3.3778 3.6519 1.4378 3.0296 2.4235 6.6434 6.8035 1.3590 6.7692 2.7411 1.6671 1.3761 1.2973 5.5771 2.2733 1.4885 1.4818 1.4839 1.4794 1.7251 1.7333 1.7292 1.7343 2.2296 2.1731 1.8776 2.0655 2.2761 2.1493 1.7830 1.1220 1.4873 4.3266 1.4291 1.4689 2.7769 1.4173 1.4767 1.4654 1.4369 1.3651 1.1918 1.4749 1.4133 3.4721 3.2675 4.1282 4.2072 2.0136 1.1665 1.1877 1.1186 1.1042 1.0569 1.0904 1.1042 1.1250 2.2304 1.0505 1.0454 1.0587 1.0549 5.0481 4.9067 4.6613 6.2962 5.3841 8.0770 9.2342 1.1242 1.0382 1.0394 1.0387 1.0377 1.0377 1.0369 1.0835 1.1013 1.0987 1.0916 1.1001 1.0978 1.0969 1.0969 1.1021 1.1054 1.1061 1.1054 1.1034 1.0975 1.0866 1.0928 1.0952 1.0919
irintensity: 523.2693 0.0745 0.4784 0.6427 0.0942 0.1548 0.0667 1.0196 0.7894 0.1785 0.7823 1.8579 0.2880 0.2497 0.1906 1.0408 1.3468 1.0766 0.8969 0.0158 0.5032 1.1118 0.7853 0.1335 1.7685 1.9547 2.6253 0.6279 0.5923 1.9474 0.0341 0.0172 0.1000 0.5732 1.1431 0.1458 2.6266 4.0433 1.4517 4.3340 0.0643 5.0125 0.1990 3.9732 11.6074 6.3258 11.3848 29.9694 15.5518 48.3079 2.0636 9.3998 0.7770 19.7634 6.7671 1.2308 0.0908 3.6005 0.1725 2.6190 0.3639 1.0542 7.8427 8.2831 7.9933 18.9434 93.6875 84.3744 0.9854 1.5093 7.5073 0.4563 7.1752 44.7881 2.3151 10.6883 4.3859 22.6090 115.9087 0.2649 0.4038 2.5968 0.2010 0.6056 0.3448 10.7881 0.2128 47.4365 25.4524 2.2916 1.5837 3.1304 3.9731 1.1714 5.4230 12.5715 1.9347 5.1925 3.6925 69.5729 49.3405 318.8280 36.7809 11.6902 3.3064 48.3510 16.2989 16.5643 5.3223 44.8131 3.8358 37.8772 47.6371 43.2109 19.1816 3.4222 23.1884 30.5497 189.6766 337.5162 301.7259 37.9519 16.5966 0.3744 8.7122 4.5100 99.4827 6.8034 16.5912 39.1817 16.2258 12.0997 6.0464 4.5133 1.3365 15.7379 1.2984 2.3630 3.1311 1.3063 10.4620 507.4925 298.2078 207.6573 10.3111 60.0677 3.8121 3.5915 5.7282 2.5477 5.0173 8.5817 10.7478 18.2958 7.1714 6.4677 4.5489 5.7009 9.2486 6.0521 5.8291 6.9381 7.9947 3.3316 2.9263 17.0048 12.4119 3.7726
temp: 298.150 k
press: 1.00000 atm
elementType: 6 6 8 6 1 6 8 45 45 8 8 8 8 8 8 8 8 6 6 6 6 6 1 1 1 6 1 1 1 6 1 1 1 6 1 1 1 6 6 6 6 1 6 6 1 1 1 1 6 1 1 1 1 6 1 1 1 53
symmnumber: 1
zpe: 1133139.2 jmol-1
zpe.correction: 0.431590 hartree
zpe.thermalcorrener: 0.469471 hartree
zpe.thermalcorrenthalpy: 0.470415 hartree
zpe.thermalcorrgfe: 0.357735 hartree
zpe.sumelectzpe: -1759.615886 hartree
zpe.sumelectthermal: -1759.578005 hartree
zpe.sumelectthermalent: -1759.577061 hartree
zpe.sumelectthermalfe: -1759.689741 hartree
dipole: -4.8607 2.4077 0.1436
dipole: 5.4262
quadrupole: -234.4267 -200.1681 -233.9060
quadrupole: 4.3838 7.3342 -6.2724
quadrupole: -11.5931 22.6655 -11.0724 4.3838 7.3342 -6.2724
hfenergy: -1760.0474762 hartree
pointgroup: C01 [X(C20H25I1O10Rh2)]
dipole: -1.8578666 0.9197633 -0.5097797 debye
polarizability: 349.6918148|12.8377865|394.4371079|1.0353562|-14.6059557|321.4665848 unknown
InChI: InChI=1S/C12H13IO2.4C2H3O2.2Rh/c1-9(2)8-15-12(14)7-10-5-3-4-6-11(10)13;4*1-2(3)4;;/h3-9H,1-2H3;4*1H3;;/q;4*-2;2*+4
charge 0 multiplicity 1
58 atoms
C  -1.80157158 0.28951462 0.77835908
C  -1.7841237 0.97091832 2.09996025
O  -1.93077604 2.34495171 1.86777485
C  -2.36400997 2.51396504 0.58087778
H  -1.94203459 1.22653707 0.01845479
C  -1.587449 3.53369673 -0.19678185
O  -1.62865618 0.53048926 3.20332545
Rh 0.23826137 -0.04865745 0.120179
Rh 2.56223219 -0.54029568 -0.4585384
O  2.30698844 0.68793845 -2.1159164
O  1.86855828 -2.14892491 -1.56238023
O  2.65315104 -1.73250061 1.22772581
O  3.08872961 1.11024495 0.69092228
O  -0.28789416 -1.69803472 -1.00636235
O  0.16060916 1.17291544 -1.55382353
O  0.48818626 -1.28446392 1.75492302
O  0.92518024 1.58913293 1.19388252
C  1.61650001 -1.84810675 1.94854181
C  2.186209 1.79250873 1.25740801
C  1.19498548 1.26047226 -2.30089764
C  0.61995356 -2.36779424 -1.60040001
C  2.62293928 2.95418843 2.12247859
H  3.63939915 3.25988564 1.86866508
H  1.92673376 3.78943401 2.01037542
H  2.59708161 2.63759956 3.17155028
C  1.04488851 2.13137619 -3.5294486
H  1.99768502 2.22752854 -4.0516682
H  0.30181098 1.68090859 -4.19658199
H  0.67070498 3.11789199 -3.23919272
C  0.1331919 -3.51491411 -2.45765554
H  -0.19508735 -3.11319938 -3.42348147
H  0.93627871 -4.23415747 -2.62818761
H  -0.72705739 -3.99458158 -1.98432851
C  1.69699864 -2.75831312 3.15368724
H  1.14554529 -3.68040296 2.93737584
H  2.73593452 -3.00492956 3.37840675
H  1.21913892 -2.27749825 4.01144863
C  -2.67202529 -0.87726147 0.58585759
C  -2.83709216 -1.76186587 1.68058111
C  -3.26311104 -1.25902182 -0.63569301
C  -3.52893172 -2.9590439 1.54878728
H  -2.36631035 -1.50790688 2.62107455
C  -3.98531066 -2.44406818 -0.76095529
C  -4.11176396 -3.30465229 0.32952894
H  -3.61567171 -3.61982349 2.40652444
H  -4.44279446 -2.70060499 -1.71000962
H  -4.66194019 -4.2347716 0.21926048
H  -3.4442391 2.42788577 0.43450671
C  -1.7560996 4.88876461 0.54336694
H  -1.14659597 5.64335847 0.03464263
H  -2.79964764 5.22405368 0.52201977
H  -1.43002797 4.81653145 1.58382967
H  -0.53518674 3.2352486 -0.1315713
C  -2.01553779 3.63120689 -1.66245962
H  -1.74521095 2.72141208 -2.19921171
H  -3.09565399 3.7972514 -1.75780538
H  -1.50570815 4.4760168 -2.1382401
I  -3.14320568 -0.03547999 -2.39233863
