program: Gaussian 16
title: wamser cis sm 631gd
version: ES64L-G16RevA.03
method: RB3LYP
basis: GenECP
operation: Freq
keyword: #N
keyword: Geom=AllCheck
keyword: Guess=TCheck
keyword: SCRF=Check
keyword: GenChk
keyword: RB3LYP/GenECP
keyword: Freq
converged: YES YES YES YES
title: Mulliken charges:
elementType: C C O C H C O Rh Rh O O O O O O O O C C C C C H H H C H H H C H H H C H H H C C C C H C C H H H H C H H H H C H H H Cl
charge: -0.486252 0.670957 -0.420530 0.062803 0.286194 -0.113138 -0.372874 0.400320 0.525400 -0.487164 -0.497427 -0.501940 -0.491516 -0.494352 -0.514597 -0.477605 -0.507381 0.667274 0.671918 0.666765 0.666626 -0.538298 0.190747 0.189360 0.172469 -0.532867 0.178915 0.189104 0.178648 -0.531564 0.177201 0.183562 0.190665 -0.534047 0.195716 0.186156 0.181334 0.205875 -0.133880 -0.137312 -0.140769 0.206950 -0.124579 -0.114879 0.140815 0.159056 0.145655 0.199649 -0.460701 0.161949 0.151778 0.179593 0.206962 -0.492289 0.205910 0.150664 0.155050 0.003920
chargesum: -0.00000
title: Mulliken charges with hydrogens summed into heavy atoms:
elementType: C C O C C O Rh Rh O O O O O O O O C C C C C C C C C C C C C C C C Cl
charge: -0.200058 0.670957 -0.420530 0.262452 0.093824 -0.372874 0.400320 0.525400 -0.487164 -0.497427 -0.501940 -0.491516 -0.494352 -0.514597 -0.477605 -0.507381 0.667274 0.671918 0.666765 0.666626 0.014278 0.013800 0.019864 0.029160 0.205875 0.073069 -0.137312 0.000046 0.034476 0.030776 0.032619 0.019335 0.003920
chargesum: 0.00000
1716.lowfreq: -565.5371 -4.0550 -2.2212 0.0012 0.0015 0.0016 3.9627 11.7036 29.7370
frequency: -565.5371 11.4293 29.7367 30.3891 39.0727 41.9790 43.6440 46.8951 52.3521 54.8242 59.0216 62.8422 66.0031 68.4754 79.0123 85.4613 101.9340 106.7921 119.4158 128.2195 136.8344 142.1051 155.3826 163.9735 169.9212 184.7528 192.1735 206.5409 208.5927 216.1197 234.5992 239.5116 240.1361 241.1943 245.3109 255.5360 267.2883 280.6476 285.4654 294.3052 307.3087 310.6931 321.4821 326.6167 333.2105 356.1658 367.6767 371.3212 375.4571 399.1336 444.0961 465.1022 468.3477 502.8734 525.0842 568.9841 572.7639 581.8871 588.3606 595.5988 606.5124 620.0190 622.0427 623.7128 658.7380 665.1175 697.8987 699.3079 711.6626 718.5129 725.7439 730.6598 738.5030 775.9664 844.7182 866.9016 884.6023 896.1688 951.4357 952.5478 953.0052 962.6312 966.5409 968.6558 972.8566 987.4830 997.3358 1041.7000 1053.2079 1053.7154 1056.9039 1057.3809 1061.1473 1075.0815 1076.9786 1077.1830 1078.6235 1086.4333 1111.6709 1156.8411 1165.2899 1192.5141 1208.7785 1210.8969 1213.1346 1272.6231 1300.5418 1331.4665 1333.6988 1339.5605 1371.5188 1400.0976 1402.0663 1403.0823 1406.8575 1424.1819 1447.3892 1455.7490 1458.2153 1458.5534 1463.1262 1466.7196 1474.9097 1487.0371 1489.5677 1490.6248 1494.1419 1505.8497 1506.1639 1508.5295 1509.4787 1515.1473 1517.9712 1523.1348 1535.2605 1549.4958 1576.1493 1580.4714 1609.6121 1611.5917 1643.6931 1670.5536 1908.7205 2272.9928 3042.6413 3048.7082 3064.2338 3065.6974 3066.4817 3066.5976 3108.0933 3112.2172 3114.5348 3129.9546 3130.3709 3130.4896 3136.5321 3137.3727 3139.1423 3144.7131 3173.1971 3177.0009 3177.0233 3177.1768 3194.3981 3210.3031 3226.3762 3274.6826
redmass: 1.5708 5.0912 1.0397 7.2652 1.5974 1.7888 1.9516 3.6530 1.8404 1.5396 3.1195 3.4241 2.8240 2.1712 6.0279 5.5009 5.4590 8.0501 3.9971 4.8747 5.9754 5.4903 7.6228 10.1730 5.0900 6.8004 7.2349 6.3538 14.3874 6.7450 6.5431 1.1289 5.6525 5.3941 5.8800 1.6046 2.7826 7.7766 7.0982 4.6431 10.4986 6.8594 5.5670 3.2850 7.5184 4.8795 7.7020 8.5799 3.8147 3.9453 3.9680 4.4305 3.0846 4.2309 5.5905 4.7749 4.8398 6.1499 5.1877 5.3450 2.9044 3.0261 3.0299 3.0132 6.1556 6.1370 7.7574 7.7132 6.2630 7.5614 7.4970 7.0588 3.7545 1.3678 3.2206 3.0918 1.5545 3.9063 4.6055 4.8651 2.7494 6.6369 4.5447 1.3800 1.3941 1.4067 1.3014 2.7149 1.4886 1.4886 1.4795 1.4764 6.7831 1.7283 1.7341 1.7354 1.7379 2.0983 2.3899 1.8090 1.7916 1.8149 1.3776 1.9236 1.7933 1.7459 1.7004 1.6648 2.5462 2.0478 1.2901 1.5091 1.4464 1.4343 1.3615 1.1977 1.4572 3.1070 3.8320 3.6652 1.6782 3.0305 2.1096 1.1803 1.1672 1.1306 1.1014 1.0568 1.0549 1.1188 1.1356 2.2494 1.0557 1.0435 1.0602 1.0538 4.8643 5.1191 6.0118 5.0032 5.3310 8.0407 12.1212 1.0786 1.0370 1.0352 1.0383 1.0375 1.0384 1.0392 1.0961 1.0906 1.1003 1.1034 1.0996 1.0986 1.1010 1.0964 1.0951 1.0895 1.1062 1.1056 1.1048 1.1041 1.0870 1.0933 1.0950 1.0919
irintensity: 449.0223 0.5286 0.1824 0.0979 0.7925 1.1687 0.0905 0.5414 0.4055 0.2892 0.7305 0.6577 2.1604 0.4083 0.1357 3.1664 0.4558 3.9481 0.0980 0.5583 1.3058 1.0349 0.3219 0.0718 4.5416 2.8801 11.1240 2.7210 0.2482 0.1637 0.0936 0.1193 0.3620 0.0696 1.3637 0.6639 5.5192 0.9162 0.9127 0.7028 4.4491 0.6863 6.0494 14.2843 8.1434 3.4446 43.3992 42.4921 2.7907 12.7817 14.4541 0.8888 14.5046 9.4108 12.5618 0.5780 2.2745 28.8122 0.6036 5.3362 0.1866 6.4443 2.5092 10.0513 25.1195 7.0977 89.1219 90.8187 10.5172 2.9233 5.7370 9.1852 21.3835 31.8451 16.3840 11.5231 1.0927 32.4049 19.5555 15.0514 58.1386 0.0888 3.1408 13.2878 2.6072 10.0166 0.4627 12.9793 3.4496 3.3403 2.9631 3.4718 43.1506 0.6608 4.8865 13.4320 4.3156 23.9301 1.1606 127.9693 60.6478 57.3727 29.0312 55.2892 26.8775 35.0357 8.6591 5.8284 13.6115 80.5227 9.3429 44.9522 60.4187 29.5585 16.0694 2.6397 40.5921 204.9926 147.2090 414.1731 132.2880 24.9319 25.5081 2.2381 1.0167 5.1269 109.4242 11.3822 4.1113 44.7286 9.8243 10.3193 6.3042 3.7072 3.9337 10.5915 0.3077 6.3752 7.5692 11.8652 32.6848 565.0355 284.1044 216.5358 17.0926 41.1532 4.7752 5.2075 2.4581 5.2311 19.3529 3.2048 5.3863 10.0378 10.1550 4.6916 10.2275 6.3873 5.4025 8.3921 6.2745 0.7290 6.0631 11.0186 3.3841 15.9287 8.1689 8.5151
temp: 298.150 k
press: 1.00000 atm
elementType: 6 6 8 6 1 6 8 45 45 8 8 8 8 8 8 8 8 6 6 6 6 6 1 1 1 6 1 1 1 6 1 1 1 6 1 1 1 6 6 6 6 1 6 6 1 1 1 1 6 1 1 1 1 6 1 1 1 17
symmnumber: 1
zpe: 1137118.1 jmol-1
zpe.correction: 0.433105 hartree
zpe.thermalcorrener: 0.470665 hartree
zpe.thermalcorrenthalpy: 0.471609 hartree
zpe.thermalcorrgfe: 0.359646 hartree
zpe.sumelectzpe: -2208.419344 hartree
zpe.sumelectthermal: -2208.381785 hartree
zpe.sumelectthermalent: -2208.380840 hartree
zpe.sumelectthermalfe: -2208.492803 hartree
dipole: 4.3431 1.2663 4.8352
dipole: 6.6215
quadrupole: -228.5064 -194.9365 -218.9735
quadrupole: -3.2317 15.2719 1.3815
quadrupole: -14.3676 19.2023 -4.8347 -3.2317 15.2719 1.3815
hfenergy: -2208.8524492 hartree
pointgroup: C01 [X(C20H25Cl1O10Rh2)]
dipole: -1.7442129 0.9372087 -1.6929158 debye
polarizability: 373.7208284|5.911555|349.0895947|-6.2500839|24.3267995|299.2444566 unknown
InChI: InChI=1S/C12H13ClO2.4C2H3O2.2Rh/c1-9(2)8-15-12(14)7-10-5-3-4-6-11(10)13;4*1-2(3)4;;/h3-9H,1-2H3;4*1H3;;/q;4*-2;2*+4
charge 0 multiplicity 1
58 atoms
C  -1.90856123 0.13769726 0.41808739
C  -1.99685435 0.58681431 1.825844
O  -2.06207616 2.01024954 1.76118822
C  -2.44493739 2.25378264 0.47461511
H  -1.74987499 1.14504891 -0.19694852
C  -1.81156374 3.4223682 -0.22263441
O  -1.94495206 -0.01458779 2.85524073
Rh 0.33132591 -0.15703124 0.07057901
Rh 2.71541978 -0.46853687 -0.364454
O  2.34222931 0.16964676 -2.31288661
O  2.29702609 -2.4161355 -0.91111836
O  2.92493845 -1.07093237 1.59478354
O  2.99326141 1.50179138 0.22202662
O  0.08886699 -2.14804373 -0.45007707
O  0.12352158 0.45048399 -1.91751046
O  0.71108061 -0.75315576 2.00145874
O  0.77267418 1.80194718 0.5880372
C  1.89421386 -1.08314816 2.33838618
C  1.98992036 2.19194568 0.56303348
C  1.16934863 0.48824296 -2.65675856
C  1.10242148 -2.83043392 -0.81510485
C  2.22719553 3.62885685 0.97441232
H  1.75673602 3.8127499 1.94497911
H  3.29552643 3.84369932 1.02379927
H  1.75390258 4.29611084 0.24496782
C  0.95620955 0.98023346 -4.07214235
H  0.67547743 2.03914795 -4.04460398
H  1.86529441 0.85934704 -4.66276562
H  0.1280994 0.43275274 -4.53240853
C  0.84306443 -4.28596229 -1.13526452
H  -0.15761423 -4.40650337 -1.55692016
H  1.603969 -4.66681863 -1.8193279
H  0.89061541 -4.8625654 -0.20408354
C  2.07160541 -1.56612966 3.75992327
H  1.30934371 -1.12513788 4.4051338
H  1.95038233 -2.65565293 3.77657046
H  3.07564394 -1.32691989 4.11715836
C  -2.86904482 -0.77680598 -0.22520398
C  -2.50907861 -1.37485023 -1.45482983
C  -4.17225245 -1.06378432 0.25327838
C  -3.35140183 -2.25335414 -2.12517282
H  -1.54234825 -1.13304975 -1.87253611
C  -5.0094524 -1.97193708 -0.39415558
C  -4.59518159 -2.57567522 -1.58017294
H  -3.03165832 -2.69486608 -3.06444608
H  -5.98998701 -2.17834372 0.02072015
H  -5.25515434 -3.27748827 -2.08234198
H  -3.49776018 2.05458752 0.25331461
C  -2.47969031 4.70483148 0.32585277
H  -2.00405733 5.58165137 -0.12750797
H  -3.54766079 4.73230195 0.07856568
H  -2.37122381 4.77392999 1.41243327
H  -0.75451176 3.417359 0.05137473
C  -1.9536616 3.29868738 -1.74668399
H  -1.4042811 2.42674926 -2.11846163
H  -3.00610554 3.20588077 -2.04417149
H  -1.54929494 4.19314543 -2.23227676
Cl -4.85786479 -0.23333198 1.64364367
