program: Gaussian 16
title: Template file
version: ES64L-G16RevA.03
method: RB3LYP
basis: GenECP
operation: Freq
keyword: #
keyword: B3LYP/genecp
keyword: freq=hpmodes
keyword: em=gd3
keyword: int=ultrafine
title: # B3LYP/genecp freq=hpmodes em=gd3 int=ultrafine
converged: NO YES NO NO
title: Mulliken charges:
elementType: C C O C H O Rh Rh O O O O O O O O C C C C C H H H C H H H C H H H C H H H C C C C H C C H H Br H O C H H H C C C C H C H C H H H
charge: -0.501533 0.699357 -0.421081 -0.132605 0.266529 -0.391457 0.520103 0.487338 -0.489664 -0.497921 -0.496343 -0.494590 -0.492882 -0.511933 -0.488869 -0.500401 0.672759 0.666427 0.672103 0.667028 -0.531303 0.190531 0.182721 0.180164 -0.534338 0.173835 0.189103 0.181053 -0.532941 0.183101 0.182150 0.183415 -0.534835 0.181129 0.184584 0.186506 0.179835 -0.261022 0.067113 0.377363 0.197259 -0.148161 -0.167198 0.153327 0.148304 -0.132216 0.230533 -0.488008 -0.222622 0.159740 0.169885 0.168516 0.208870 -0.172743 -0.151144 -0.124989 0.168240 -0.129363 0.150492 -0.116420 0.146633 0.145079 0.145458
chargesum: -0.00000
title: Mulliken charges with hydrogens summed into heavy atoms:
elementType: C C O C O Rh Rh O O O O O O O O C C C C C C C C C C C C C C Br O C C C C C C C
charge: -0.235004 0.699357 -0.421081 0.097928 -0.391457 0.520103 0.487338 -0.489664 -0.497921 -0.496343 -0.494590 -0.492882 -0.511933 -0.488869 -0.500401 0.672759 0.666427 0.672103 0.667028 0.022113 0.009654 0.015725 0.017383 0.179835 -0.063763 0.067113 0.377363 0.005166 -0.018894 -0.132216 -0.488008 0.275520 0.208870 -0.004504 -0.000651 0.021643 0.015716 0.029039
1716.lowfreq: -515.9739 -2.4781 -0.0055 -0.0052 -0.0044 2.1284 3.1785 8.3484 16.2994
frequency: -515.9739 8.1581 16.2855 19.6210 26.1032 27.2100 29.3684 36.5967 42.4012 44.9886 54.0015 59.4407 62.5634 64.3418 67.3462 69.2251 78.6164 79.4244 86.7646 104.0685 120.5953 124.2674 127.4090 132.6001 149.9033 154.0212 158.8852 176.8467 182.0275 194.5441 207.4003 215.5746 230.2987 239.6920 240.7116 242.7137 248.4393 251.8957 271.8426 274.2554 286.7395 288.0007 290.6835 305.2788 311.1855 318.2436 335.3950 339.6791 363.2360 366.5246 370.4804 373.4692 406.9183 410.8555 456.8446 488.6817 504.0165 527.1634 571.5794 573.7185 581.7343 585.7221 592.2099 606.6309 613.3725 619.9061 620.3475 622.1161 622.9968 628.6034 632.1345 681.8735 695.8568 696.6181 699.5054 714.2136 717.1015 722.5721 743.1999 761.9858 791.2727 828.9228 842.5844 849.4426 852.6036 902.1945 910.4126 931.0982 951.2385 953.3512 961.6425 966.5521 969.5348 970.4299 973.4160 1005.0671 1010.5313 1016.5530 1048.6280 1052.2253 1054.3129 1054.7921 1055.4757 1055.5700 1074.7506 1076.6741 1077.3354 1078.5569 1089.1712 1110.0852 1139.5520 1150.3721 1176.7738 1185.2311 1205.5353 1221.6637 1224.3272 1256.1622 1272.2623 1306.1059 1314.6325 1347.8163 1362.6086 1376.7176 1399.4140 1400.7082 1401.3483 1402.2628 1405.1511 1426.3444 1455.2888 1456.4527 1457.9151 1464.2544 1483.9981 1489.1395 1490.2034 1492.5252 1496.4264 1503.7279 1504.4600 1505.0668 1505.5768 1506.5146 1509.8041 1524.3337 1525.1840 1537.4606 1551.4928 1578.5415 1582.0709 1610.5954 1612.1129 1636.1468 1643.3466 1661.9888 1672.2351 1758.1795 1888.0001 3027.6246 3065.5908 3067.5296 3067.8493 3067.9740 3089.6996 3129.0416 3133.0792 3133.6857 3136.1116 3150.6232 3159.5239 3175.0891 3175.2909 3175.7062 3176.7663 3190.6253 3197.4414 3207.5834 3215.0536 3217.2486 3225.3886 3229.9304 3264.8128
redmass: 2.0056 6.1353 4.4477 4.5472 1.1824 1.2965 4.3900 1.1158 2.0836 2.1465 3.7299 2.5512 3.3941 2.3616 4.2441 5.3532 8.0036 8.1062 10.0181 7.2444 3.7707 9.5731 4.3792 4.9790 5.5353 12.3779 14.9622 4.7274 5.8332 4.4178 14.9959 6.8652 6.8220 6.8437 6.3270 5.9574 5.6958 5.1519 1.4948 8.1549 7.5121 4.4750 8.4849 9.6938 6.8174 5.8903 7.3667 4.3214 5.8942 6.4743 9.4318 6.6913 6.2039 2.9537 3.4977 3.8445 3.8910 6.0890 4.8083 4.8343 5.2129 5.1467 5.2902 2.9033 4.8339 5.6164 3.0699 3.0516 3.0446 6.2665 5.3135 5.7535 6.2901 2.2592 7.2879 7.1019 4.1955 7.3465 4.6716 1.7560 4.6205 2.7482 1.7483 3.6147 1.3117 1.6441 2.1491 1.9161 6.0132 6.7212 6.7765 7.0828 1.3390 1.8771 1.3848 1.3029 4.0396 5.5370 6.2973 1.4953 1.4894 1.4895 2.1326 1.5701 1.7225 1.7284 1.7279 1.7301 4.1403 2.4422 2.1918 2.0916 2.0346 1.2728 1.1130 1.1835 1.3791 1.9817 2.9693 2.7226 2.6278 2.2268 4.5732 2.2489 1.4754 1.4477 1.4560 1.5066 1.3727 2.6378 4.2335 4.2433 4.1814 4.2410 1.4459 1.1749 1.1947 1.1598 1.1368 1.2250 1.0630 1.0649 1.0528 1.0920 1.9396 1.1609 1.6476 1.1747 2.1464 4.9413 4.9931 6.3365 6.6650 5.0812 4.8524 4.6808 8.0351 1.1880 6.5157 1.0343 1.0366 1.0361 1.0363 1.0373 1.1071 1.1009 1.1004 1.1004 1.0983 1.0880 1.1011 1.1053 1.1046 1.1043 1.1035 1.0862 1.0888 1.0918 1.0882 1.0958 1.0956 1.0954 1.0898
irintensity: 1188.1459 0.3855 0.0654 0.2268 0.7734 1.1260 0.1614 0.6176 0.4558 0.6784 0.9720 0.1264 0.2556 0.1526 0.2921 0.9162 0.6478 0.9931 1.8695 4.9924 0.1342 6.2525 3.2777 0.6453 0.6557 0.1748 1.0031 2.8033 1.7161 6.0168 0.0215 0.0355 0.1679 0.3751 0.6605 1.7549 4.6589 2.2614 1.3237 3.4201 1.5527 0.1855 4.6717 1.3222 0.0315 0.6465 8.5226 6.5308 21.0592 4.6858 41.3193 68.7219 4.5264 2.5556 18.4178 7.3660 2.4489 25.2222 0.4137 0.1776 10.7916 0.0199 3.8815 0.6647 7.2425 18.2684 3.4238 7.7407 5.7752 0.1186 9.5969 2.6517 72.0529 13.3168 103.9418 1.5025 11.8911 5.9374 5.5559 48.5844 6.7543 39.2600 4.4973 4.7958 0.4647 37.8455 34.3311 23.6893 0.3983 0.1377 0.8592 1.9272 0.0723 0.5402 0.1880 0.1577 29.6327 1.5404 73.2277 2.9481 2.1813 1.3025 1.0805 5.9918 1.9919 5.7255 8.1669 3.6478 29.0502 48.2680 67.8361 93.1456 172.4082 1.4257 0.3985 23.9203 3.0815 54.4265 111.0494 90.3643 50.1321 47.2813 99.7936 0.4446 55.0160 9.4893 64.2825 185.1404 23.1821 47.1483 190.1643 337.5144 355.0938 71.1886 179.9112 5.7146 8.9115 3.5539 104.5800 36.2625 16.6492 6.7333 8.2119 24.5316 36.5643 26.8652 93.5517 2.6408 34.6882 2.0037 3.3555 3.6498 22.5831 0.9091 99.5796 17.7684 519.2925 140.2110 240.1157 37.4978 4.5215 4.1859 4.6563 3.3726 28.0817 6.7629 5.0913 5.3262 5.5318 6.0374 32.3392 5.4322 7.2029 8.8756 7.6304 1.2748 1.4513 12.7300 1.3724 23.8266 8.9937 4.9086 5.4357
temp: 298.150 k
press: 1.00000 atm
elementType: 6 6 8 6 1 8 45 45 8 8 8 8 8 8 8 8 6 6 6 6 6 1 1 1 6 1 1 1 6 1 1 1 6 1 1 1 6 6 6 6 1 6 6 1 1 35 1 8 6 1 1 1 6 6 6 6 1 6 1 6 1 1 1
symmnumber: 1
zpe: 1209661.3 jmol-1
zpe.correction: 0.460736 hartree
zpe.thermalcorrener: 0.501558 hartree
zpe.thermalcorrenthalpy: 0.502503 hartree
zpe.thermalcorrgfe: 0.380161 hartree
zpe.sumelectzpe: -4547.250445 hartree
zpe.sumelectthermal: -4547.209622 hartree
zpe.sumelectthermalent: -4547.208678 hartree
zpe.sumelectthermalfe: -4547.331019 hartree
dipole: 7.2319 -0.9650 -0.1793
dipole: 7.2982
quadrupole: -250.1704 -225.7238 -251.9606
quadrupole: -8.0076 -5.6772 2.7505
quadrupole: -7.5521 16.8944 -9.3423 -8.0076 -5.6772 2.7505
hfenergy: -4547.7111806 hartree
pointgroup: C01 [X(C24H25Br1O11Rh2)]
dipole: 2.8452267 -0.3799279 -0.070527 debye
polarizability: 508.906633|-16.1311001|408.2434305|3.0732014|10.5215599|330.7208109 unknown
InChI: InChI=1S/C16H13BrO3.4C2H3O2.2Rh/c1-19-11-7-8-13(17)12(9-11)14-15(18)20-16(21-14)10-5-3-2-4-6-10;4*1-2(3)4;;/h2-9,16H,1H3;4*1H3;;/q;4*-2;2*+4
charge 0 multiplicity 1
63 atoms
C  1.103581 0.264336 0.792941
C  1.260076 0.297429 2.27839
O  1.650586 -0.963688 2.70429
C  1.977442 -1.708223 1.57222
H  1.458872 -0.962841 0.613647
O  1.07416 1.20764 3.037231
Rh -0.907498 -0.023146 0.244249
Rh -3.2726 -0.280592 -0.337974
O  -2.799554 -2.212645 -0.951387
O  -2.801162 0.415083 -2.232879
O  -3.563136 1.663028 0.3111
O  -3.566697 -0.960874 1.60385
O  -0.622257 0.720331 -1.66335
O  -0.614942 -1.979825 -0.374276
O  -1.368514 1.894773 0.860608
O  -1.361167 -0.777668 2.120046
C  -2.570855 2.311905 0.757582
C  -2.579701 -1.053589 2.390722
C  -1.613115 -2.632079 -0.839707
C  -1.605644 0.759066 -2.474744
C  -2.848741 -1.512781 3.806891
H  -2.789262 -0.645319 4.473981
H  -3.841638 -1.958931 3.883186
H  -2.079824 -2.223595 4.121341
C  -1.312861 -4.042287 -1.300648
H  -0.887535 -4.616004 -0.470543
H  -2.218872 -4.529445 -1.663419
H  -0.562683 -4.007656 -2.097747
C  -1.282962 1.280031 -3.858027
H  -0.424964 0.730805 -4.257732
H  -2.144202 1.179266 -4.520127
H  -0.993546 2.333885 -3.784855
C  -2.808317 3.734631 1.215407
H  -2.242324 4.417068 0.57222
H  -3.870238 3.980493 1.170018
H  -2.433523 3.8554 2.236377
C  1.923991 1.161138 -0.023448
C  2.171747 2.463789 0.466663
C  2.401561 0.829862 -1.305102
C  2.839726 3.405594 -0.314387
H  1.783447 2.718637 1.442495
C  3.109465 1.76109 -2.063738
C  3.321255 3.046634 -1.582767
H  3.485885 1.477069 -3.040216
H  3.850985 3.787159 -2.172751
Br 2.148877 -0.913091 -2.046512
H  1.296407 -2.544905 1.403124
O  3.082729 4.687545 0.072248
C  2.574427 5.115642 1.33016
H  3.015841 4.545816 2.158571
H  2.855662 6.16611 1.422575
H  1.481269 5.022848 1.373637
C  3.394372 -1.904783 1.273745
C  4.369997 -1.01791 1.761574
C  3.771544 -2.963284 0.429041
C  5.704309 -1.195353 1.408566
H  4.076937 -0.205791 2.418668
C  5.106777 -3.137097 0.082754
H  3.010489 -3.634597 0.040689
C  6.074381 -2.251982 0.56995
H  6.458119 -0.511247 1.786933
H  5.395609 -3.956761 -0.568389
H  7.117168 -2.38634 0.296552
