program: Gaussian 16
title: Title Card Required
version: ES64L-G16RevC.01
method: UB3LYP
basis: GenECP
operation: Freq
keyword: #N
keyword: Geom=AllCheck
keyword: Guess=TCheck
keyword: SCRF=Check
keyword: GenChk
keyword: UB3LYP/GenECP
keyword: Freq
converged: YES YES NO YES
elementType: C
elementType: O
elementType: H
elementType: Br
1716.lowfreq: -125.1198 0.0084 0.0097 0.0102 2.4610 2.7241 3.9001 10.4736 11.9476
frequency: -125.1198 10.1924 11.9445 17.0431 17.6207 23.7093 25.8042 28.9816 31.1224 44.5757 50.3011 57.0040 58.8107 61.2121 63.7729 64.7829 67.7687 73.5836 77.2210 98.9109 110.4009 120.2928 124.1219 131.5990 136.1067 153.3700 159.0606 168.5974 184.8787 194.5591 208.9994 215.4935 224.6759 236.0763 239.3671 241.5410 243.6275 245.3927 253.5557 269.1362 282.8362 283.8197 294.0535 297.5878 316.0823 318.9511 327.8350 342.6081 348.7153 364.7243 374.2291 375.7362 392.1828 415.3222 431.4547 446.9454 475.2142 501.6021 521.2207 573.9391 575.3382 582.1008 590.7002 597.9703 606.4626 611.7501 620.6081 622.0801 623.6158 626.4233 637.8620 645.6368 684.0091 692.4479 699.6460 700.5279 703.4132 720.1466 720.7504 728.5425 754.9933 772.5838 786.2058 831.3909 860.3207 866.6909 897.4046 907.5833 952.4161 952.7284 956.2907 964.0666 965.5699 968.1511 991.6294 998.0631 1012.0290 1018.8742 1026.4800 1053.0537 1054.9320 1055.3451 1055.9235 1057.2088 1075.2973 1077.0100 1078.1089 1079.1294 1085.2272 1113.0815 1129.7167 1167.1413 1185.5686 1205.4090 1222.5177 1224.2028 1254.2787 1260.6464 1297.0538 1321.3103 1340.8134 1350.3020 1371.7609 1384.1703 1403.4217 1403.7663 1404.1397 1408.2416 1442.6565 1456.3539 1459.5067 1460.9960 1461.2474 1468.3106 1483.2329 1486.6603 1488.3023 1490.0881 1493.3211 1506.0289 1507.5427 1508.2711 1508.9434 1509.9939 1524.0274 1525.7634 1533.3918 1540.1503 1556.0650 1569.5504 1570.5901 1602.6239 1609.8682 1627.5271 1644.0426 1654.3078 1666.2853 1907.7294 3026.0328 3066.1890 3067.8015 3067.8793 3068.8207 3087.0169 3134.3093 3136.4865 3138.6926 3139.2890 3155.4764 3166.9360 3174.2763 3175.0839 3175.3359 3175.8979 3189.0718 3195.2564 3207.7095 3214.9232 3218.2246 3229.9668 3244.2105 3260.9124 3284.8216
redmass: 8.9615 7.9929 7.2777 3.2010 1.2680 5.3999 1.1171 2.0710 1.5263 6.6183 5.2884 2.4467 3.4619 2.4161 3.8482 3.5504 1.5668 11.7166 6.9957 6.5421 6.3370 4.1791 4.8436 4.8157 5.2320 17.1319 13.1828 5.8046 4.9489 7.8318 14.2856 6.9931 5.7291 6.5040 7.1410 5.2061 6.2819 1.7135 5.4204 5.8982 7.0299 7.5075 4.2233 2.7246 6.7794 8.5923 5.7805 4.3162 20.9092 8.2005 9.4583 9.4505 4.8854 3.2244 5.2648 4.5087 3.1996 4.3480 3.5441 4.8159 4.8665 7.1618 5.2477 5.3400 2.9391 5.9594 2.9966 3.0751 3.0656 6.2563 4.3642 5.2235 5.0552 2.4563 6.0206 7.7226 3.1314 2.0698 7.2808 7.4846 2.5070 1.9285 3.5790 1.4580 1.2676 4.2773 1.5655 1.5786 6.2447 6.8124 1.4361 7.0317 1.3215 7.2120 1.3554 4.2769 4.7838 1.3745 6.8543 2.2047 1.4857 1.4850 1.4795 1.4794 1.7292 1.7370 1.7341 1.7358 5.1594 2.9664 1.6530 1.4691 1.2729 1.1136 1.3690 1.1923 1.8464 3.0573 2.2580 3.4087 2.2742 2.2237 2.0159 2.6268 1.4248 1.4253 1.4282 1.3442 3.0584 1.8221 3.6511 3.8579 3.9369 3.8835 2.2634 1.2023 1.2380 1.1346 1.1056 1.2554 1.1216 1.1111 1.1192 1.1467 1.0482 1.9537 1.4271 1.5480 2.6614 4.4646 4.6408 6.0784 6.3318 4.6158 4.8711 5.0804 7.9457 12.0364 1.0342 1.0373 1.0386 1.0379 1.0377 1.1069 1.0986 1.0979 1.0975 1.0961 1.1010 1.0899 1.1051 1.1052 1.1061 1.1057 1.0868 1.0890 1.0927 1.0880 1.0972 1.0954 1.0940 1.0894 1.0885
irintensity: 63.0251 0.2492 0.1279 0.2619 0.2713 0.7267 0.4235 0.3722 0.8397 0.8299 0.3439 0.3440 0.8269 0.4020 0.7245 1.2117 0.9992 0.0196 3.1344 0.5996 8.3216 0.0383 3.6973 0.1400 2.4496 0.3850 1.3998 10.4148 0.8573 1.0775 0.3880 0.1600 1.7777 0.0213 0.0976 0.3807 0.1319 0.8937 3.2042 0.5967 0.5394 0.7146 0.0170 0.5810 0.3508 0.4373 20.3631 1.8079 16.2232 3.7548 57.4338 48.5648 15.0910 1.8868 24.0561 36.0406 10.3943 1.3250 7.2286 0.0281 0.2536 14.9365 0.0655 3.5932 2.4573 14.0321 2.2365 6.6107 7.6654 0.4529 13.0118 12.4952 11.2654 17.8616 53.3085 118.8304 95.4345 8.5379 2.5130 0.9070 17.3114 86.3500 10.7898 22.5569 3.6049 55.2819 56.9664 25.9554 0.4191 0.4100 5.4688 0.1430 0.0595 0.1706 1.8141 33.5254 1.1588 2.1752 35.9954 1.6246 0.4551 1.2522 4.9115 7.7419 1.8624 7.3340 11.6166 1.7636 45.5510 25.4567 3.5199 8.9993 0.6564 1.0235 13.8752 21.6854 64.1100 133.4557 159.0921 156.8300 72.9823 85.6340 46.1761 8.1297 19.9601 37.6428 59.5354 5.6971 58.7685 9.1545 94.9842 426.6642 370.3884 12.6901 119.6915 4.1856 13.3919 7.8412 114.5265 12.1143 36.0439 10.0516 27.6513 28.1833 8.3547 135.1997 39.2243 1.8588 80.5498 3.1630 1.5328 0.7826 44.1513 13.4502 162.1773 40.9910 703.1651 534.6029 40.2667 4.1658 4.6717 1.5720 2.6500 34.1617 4.3424 5.6917 5.3603 4.8871 42.1385 35.2623 6.1885 6.3351 6.8632 8.4489 3.8776 1.6189 19.6070 1.8318 26.7915 10.4609 21.4917 6.5640 2.9751
temp: 298.150 k
press: 1.00000 atm
elementType: 6 6 8 6 1 8 45 45 8 8 8 8 8 8 8 8 6 6 6 6 6 1 1 1 6 1 1 1 6 1 1 1 6 1 1 1 6 6 6 6 1 6 6 1 1 35 8 6 1 1 1 6 6 6 6 1 6 1 6 1 1 1 1
symmnumber: 1
zpe: 1215923.6 jmol-1
zpe.correction: 0.463121 hartree
zpe.thermalcorrener: 0.504551 hartree
zpe.thermalcorrenthalpy: 0.505495 hartree
zpe.thermalcorrgfe: 0.379846 hartree
zpe.sumelectzpe: -4547.260751 hartree
zpe.sumelectthermal: -4547.219321 hartree
zpe.sumelectthermalent: -4547.218377 hartree
zpe.sumelectthermalfe: -4547.344026 hartree
dipole: 0.7530 3.8228 -2.1227
dipole: 4.4369
quadrupole: -277.3952 -217.6693 -237.6011
quadrupole: -7.4524 -0.3371 -2.7476
quadrupole: -33.1733 26.5526 6.6207 -7.4524 -0.3371 -2.7476
hfenergy: -4547.7238723 hartree
pointgroup: C01 [X(C24H25Br1O11Rh2)]
dipole: 0.2962552 1.5039892 -0.8351438 debye
polarizability: 530.1663351|-105.8014227|507.0437282|31.6618199|-3.4571178|306.3360842 unknown
InChI: InChI=1S/C16H13BrO3.4C2H3O2.2Rh/c1-19-14-7-8-15(17)13(9-14)10-16(18)20-11-12-5-3-2-4-6-12;4*1-2(3)4;;/h2-11H,1H3;4*1H3;;/q;4*-2;2*+4
charge 0 multiplicity 1
63 atoms
C  2.95031781 -0.09238432 -0.18340977
C  1.89016249 -0.8674193 -0.66300728
O  0.66352344 0.18130942 -0.69617945
C  1.08841066 1.13608179 -1.4804988
H  2.7154262 0.85860756 0.26595328
O  1.66420661 -1.9599389 -1.09691293
Rh -1.55646519 -0.29690462 -0.0960274
Rh -3.84935244 -0.69786215 0.51385398
O  -3.46481579 0.24095554 2.31766899
O  -3.24822514 -2.49634448 1.32199058
O  -4.10108088 -1.6123018 -1.31743721
O  -4.31751368 1.14119558 -0.3219105
O  -1.07535827 -2.08591899 0.80446603
O  -1.31592075 0.66480143 1.72672289
O  -1.92867467 -1.26097347 -1.8781466
O  -2.16577928 1.47995122 -0.95737715
C  -3.10082759 -1.70696737 -2.09784777
C  -3.39116679 1.81857974 -0.86497952
C  -2.30635267 0.71319264 2.52966777
C  -2.01088232 -2.79510938 1.29544808
C  -3.76025734 3.1484418 -1.48257513
H  -2.98231521 3.88402061 -1.25952902
H  -3.80892899 3.03248627 -2.57133794
H  -4.73112417 3.48659471 -1.11662211
C  -2.05680211 1.37080855 3.86788449
H  -1.41556869 2.24712276 3.74187779
H  -3.00046234 1.64777595 4.34078416
H  -1.52858822 0.66120303 4.5150323
C  -1.6069947 -4.130289 1.87683538
H  -0.68004575 -4.02129944 2.44564016
H  -2.40265929 -4.53237885 2.50621645
H  -1.41199268 -4.82654812 1.05325931
C  -3.30927939 -2.44715085 -3.39912166
H  -2.97459255 -3.48290206 -3.2691239
H  -4.36647423 -2.45123716 -3.67089506
H  -2.70591606 -1.99496689 -4.1896874
C  4.29697774 -0.59503789 -0.03311151
C  4.65114958 -1.9044318 -0.4464422
C  5.32753671 0.20721184 0.51002446
C  5.95370949 -2.37812421 -0.31876671
H  3.87106706 -2.53084402 -0.85585461
C  6.63267414 -0.2665781 0.6326119
C  6.9536329 -1.55465028 0.22454065
H  7.39832328 0.37740396 1.0510253
H  7.96300845 -1.94092771 0.31771475
Br 4.99293763 2.00979232 1.08944686
O  6.3580669 -3.6257114 -0.68998678
C  5.38890519 -4.5097662 -1.2364179
H  4.9559661 -4.11103135 -2.16358207
H  5.92111827 -5.43763411 -1.45446706
H  4.57924475 -4.71199906 -0.52269567
C  0.8349553 2.51504735 -1.20914016
C  0.27992055 2.93204995 0.02279008
C  1.14519079 3.47331938 -2.20038414
C  0.02821765 4.28067094 0.23741023
H  0.04256983 2.19562958 0.78144774
C  0.88564741 4.81812833 -1.97475397
H  1.58095372 3.14810496 -3.14171798
C  0.3245314 5.2226373 -0.75627228
H  -0.40115976 4.60428935 1.1811201
H  1.11929251 5.55384922 -2.73839505
H  0.12433663 6.27589565 -0.57929614
H  1.5640358 0.84757857 -2.41754287
